AMD64
no language set
Git
Scroll to End of Log
0.22s0.14s0.00s0.08s0.00sTopworker_info1Worker information2hostname: 367fd8fe-5eaa-47dd-a2ed-99944e0333b4@1.worker-com-oss-6ff4ffc9b7-t9rhk.gce-production-33version: v6.2.24 https://github.com/travis-ci/worker/tree/ee57d650a7692c1ac03f74ac073d0fd150c9f0304instance: travis-job-e5484f5a-bbb0-401c-a3a6-5c83a4aa6bc4 travis-ci-ubuntu-2204-1732291639-53689d97 (via amqp)5startup: 5.86509528ssystem_info7Build system information8Build language: python9Build dist: jammy10Build id: 27424848411Job id: 63066318712Runtime kernel version: 6.8.0-1018-gcp13VM: default14travis-build version: 6b157a1c15Build image provisioning date and time16Fri Nov 22 04:28:26 PM UTC 202417Operating System Details18Distributor ID: Ubuntu19Description: Ubuntu 22.04.5 LTS20Release: 22.0421Codename: jammy22Systemd Version23systemd 249 (249.11-0ubuntu3.12)24Cookbooks Version25be2ab50 https://github.com/travis-ci/travis-cookbooks/tree/be2ab5026git version27git version 2.47.028bash version29GNU bash, version 5.1.16(1)-release (x86_64-pc-linux-gnu)30gcc version31gcc (Ubuntu 11.4.0-1ubuntu1~22.04) 11.4.032docker version33Client:34 Version: 24.0.735 API version: 1.4336 Go version: go1.21.137 Git commit: 24.0.7-0ubuntu2~22.04.138 Built: Wed Mar 13 20:23:54 202439 OS/Arch: linux/amd6440 Context: default42Server:43 Engine:44 Version: 24.0.745 API version: 1.43 (minimum version 1.12)46 Go version: go1.21.147 Git commit: 24.0.7-0ubuntu2~22.04.148 Built: Wed Mar 13 20:23:54 202449 OS/Arch: linux/amd6450 Experimental: false51 containerd:52 Version: 1.7.1253 GitCommit:54 runc:55 Version: 1.1.12-0ubuntu2~22.04.156 GitCommit:57 docker-init:58 Version: 0.19.059 GitCommit:60clang version61clang version 18.1.862jq version63jq-1.7.164bats version65Bats 1.11.066shellcheck version670.10.068shfmt version69v3.8.070ccache version714.5.172cmake version73cmake version 3.29.074heroku version75heroku/9.5.0 linux-x64 node-v16.20.276imagemagick version77Version: ImageMagick 6.9.11-60 Q16 x86_64 2021-01-25 https://imagemagick.org78md5deep version794.480mercurial version81version 6.5.282mysql version83mysql Ver 8.0.40-0ubuntu0.22.04.1 for Linux on x86_64 ((Ubuntu))84openssl version85OpenSSL 3.0.2 15 Mar 2022 (Library: OpenSSL 3.0.2 15 Mar 2022)86packer version87Packer v1.11.288postgresql client version89psql (PostgreSQL) 14.13 (Ubuntu 14.13-0ubuntu0.22.04.1)90ragel version91Ragel State Machine Compiler version 6.10 March 201792sudo version931.9.994gzip version95gzip 1.1096zip version97Zip 3.098vim version99VIM - Vi IMproved 8.2 (2019 Dec 12, compiled Oct 16 2024 17:27:14)100iptables version101iptables v1.8.7 (nf_tables)102curl version103curl 7.81.0 (x86_64-pc-linux-gnu) libcurl/7.81.0 OpenSSL/3.0.2 zlib/1.2.11 brotli/1.0.9 zstd/1.4.8 libidn2/2.3.2 libpsl/0.21.0 (+libidn2/2.3.2) libssh/0.9.6/openssl/zlib nghttp2/1.43.0 librtmp/2.3 OpenLDAP/2.5.18104wget version105GNU Wget 1.21.2 built on linux-gnu.106rsync version107rsync version 3.2.7 protocol version 31108nvm version1090.40.1110perlbrew version111/home/travis/perl5/perlbrew/bin/perlbrew - App::perlbrew/0.95112phpenv version113rbenv 1.3.0114rvm version115rvm 1.29.12 (latest) by Michal Papis, Piotr Kuczynski, Wayne E. Seguin [https://rvm.io]116default ruby version117ruby 3.3.5 (2024-09-03 revision ef084cc8f4) [x86_64-linux]118default python version119Python 3.10.14120ElasticSearch version1217.16.3122Installed Firefox version123firefox 99.0124MongoDB version125MongoDB 6.0.19126ant version127Apache Ant(TM) version 1.10.12 compiled on January 17 1970128mvn version129Apache Maven 3.9.4 (dfbb324ad4a7c8fb0bf182e6d91b0ae20e3d2dd9)130gradle version131Gradle 8.3!132lein version133Leiningen 2.11.2 on Java 11.0.21 OpenJDK 64-Bit Server VM134Pre-installed Node.js versions135v10.24.1136v12.22.12137v14.21.3138v16.15139v16.20.2140v18.20.3141v18.20.5142v20.18.1143v22.11.0144v4.9.1145v6.17.1146v8.17.0147phpenv versions148 system149 8.1150* 8.1.2 (set by /home/travis/.phpenv/version)151 hhvm-stable152 hhvm153composer --version154Composer version 2.3.7 2022-06-06 16:43:28155Pre-installed Ruby versions156ruby-2.7.8157ruby-3.3.51600.00s0.08s0.00s0.02s0.15s0.00s0.00s0.00s0.01s0.00s0.14s0.00s1.10s0.00s0.00s22.31s0.00s3.83s0.00s3.86sdocker_mtu_and_registry_mirrorsDockerresolvconfssh_known_hosts.0161Adding ssh known hosts162$ mkdir -p ${TRAVIS_HOME}/.ssh1630.06s$ ssh-keyscan -t $TRAVIS_SSH_KEY_TYPES -H localhost 2>&1 | tee -a ${TRAVIS_HOME}/.ssh/known_hosts164# localhost:22 SSH-2.0-OpenSSH_8.9p1 Ubuntu-3ubuntu0.10165# localhost:22 SSH-2.0-OpenSSH_8.9p1 Ubuntu-3ubuntu0.10166# localhost:22 SSH-2.0-OpenSSH_8.9p1 Ubuntu-3ubuntu0.10167|1|yzRUcKd1JK1U+GGydfzk4nAfbO8=|iF4TU3zy8g+fRQslCUD/9XoTSWo= ssh-rsa AAAAB3NzaC1yc2EAAAADAQABAAABgQC3HFI6rtIj/GuMEyW1RTjiBc7+J7Vpt8P4SH+v052iAYR3E2U2zZLGrmdvSRbQlmT/gV35L078opxGKb+NYDnZ6pgeb9/id4k5UEKKtLriarKEchv1BtOhmwy+7dFV0sGqGMfcrUQDpFweJUThsiRMAFN+CguOsLIZBz6n5TIXAloW/jewoOtylEfINfTJEODKvaPl7gYORLYUpzLGuldjvyxos+FILF+Hsb38rOu1YLjWiEVk25KzQ1BHocZwk2Yin50wQHcm3JfXb95xFRGvJdCZGwICNAfr66u9tAXzG3eYOhd178trKl16GZZeXOXP7y0Sgw9GQFToBF+ybybZHq3zj5r0KTqyKatnh3ejg7K702pQpITKL+FtmHNg9SYWhSK1awwrdoTrVTNvEYF73OOxzX0cUEM24DwgXZ9IjULbaEXCRPL+zxuDMILjid/qLyWUE9zDf21CAiFI2jgwF6Zf+OnhuzpG+lvI2pR4Q2Ks1vfxchvchgCruCtSvVU=168|1|m30DrP6oEtDmMqt450/ke+PKJds=|FWkVxIhAoVReMH8D+Z6hQVVzATc= ecdsa-sha2-nistp256 AAAAE2VjZHNhLXNoYTItbmlzdHAyNTYAAAAIbmlzdHAyNTYAAABBBMIe0gbM8XDsBJmBnij8+Cb/EpVgrtMJzR3JRv5h+tdVqFRtMiz5zud9VJwPN3Yke/gSetvEWasxJG2rHVLoupc=git.checkout171Cloning into 'bit-team/backintime'...172remote: Enumerating objects: 932, done.173remote: Counting objects: 100% (932/932), done.174remote: Compressing objects: 100% (558/558), done.175remote: Total 932 (delta 541), reused 632 (delta 345), pack-reused 0 (from 0)176Receiving objects: 100% (932/932), 4.82 MiB | 22.73 MiB/s, done.177Resolving deltas: 100% (541/541), done.178$ cd bit-team/backintime180remote: Enumerating objects: 43, done.181remote: Counting objects: 100% (38/38), done.182remote: Compressing objects: 100% (9/9), done.183remote: Total 29 (delta 22), reused 26 (delta 20), pack-reused 0 (from 0)184Unpacking objects: 100% (29/29), 4.49 KiB | 270.00 KiB/s, done.185From https://github.com/bit-team/backintime186 * branch refs/pull/2039/merge -> FETCH_HEAD187$ git checkout -qf FETCH_HEAD1890.00s190Setting environment variables from .travis.yml191$ export PYTHONUNBUFFERED=1194$ python --version195Python 3.10.14196$ pip --version197pip 24.0 from /home/travis/virtualenv/python3.10.14/lib/python3.10/site-packages/pip (python 3.10)before_install.1before_install.2200Warning: apt-key is deprecated. Manage keyring files in trusted.gpg.d instead (see apt-key(8)).201OKbefore_install.3203W: http://package.perforce.com/apt/ubuntu/dists/jammy/InRelease: Key is stored in legacy trusted.gpg keyring (/etc/apt/trusted.gpg), see the DEPRECATION section in apt-key(8) for details.204W: http://apt.postgresql.org/pub/repos/apt/dists/jammy-pgdg/InRelease: Key is stored in legacy trusted.gpg keyring (/etc/apt/trusted.gpg), see the DEPRECATION section in apt-key(8) for details.before_install.4206Reading package lists... Done207Building dependency tree... Done208Reading state information... Done209screen is already the newest version (4.9.0-1).210libdbus-1-dev is already the newest version (1.12.20-2ubuntu4.1).211util-linux is already the newest version (2.37.2-4ubuntu3.4).212The following NEW packages will be installed:213 sshfs2140 upgraded, 1 newly installed, 0 to remove and 134 not upgraded.215Need to get 45.1 kB of archives.216After this operation, 126 kB of additional disk space will be used.217Get:1 http://archive.ubuntu.com/ubuntu jammy/universe amd64 sshfs amd64 3.7.1+repack-2 [45.1 kB]218Fetched 45.1 kB in 0s (112 kB/s)219Selecting previously unselected package sshfs.220(Reading database ... 132481 files and directories currently installed.)221Preparing to unpack .../sshfs_3.7.1+repack-2_amd64.deb ...222Unpacking sshfs (3.7.1+repack-2) ...223Setting up sshfs (3.7.1+repack-2) ...224Processing triggers for man-db (2.10.2-1) ...225NEEDRESTART-VER: 3.5226NEEDRESTART-KCUR: 6.8.0-1018-gcp227NEEDRESTART-KEXP: 6.8.0-1018-gcp228NEEDRESTART-KSTA: 1install.1230Requirement already satisfied: pip in /home/travis/virtualenv/python3.10.14/lib/python3.10/site-packages (24.0)231Collecting pip232 Downloading pip-25.0.1-py3-none-any.whl.metadata (3.7 kB)233Downloading pip-25.0.1-py3-none-any.whl (1.8 MB)234Installing collected packages: pip235 Attempting uninstall: pip236 Found existing installation: pip 24.0237 Uninstalling pip-24.0:238 Successfully uninstalled pip-24.0239Successfully installed pip-25.0.1install.2241Collecting pylint242 Downloading pylint-3.3.4-py3-none-any.whl.metadata (12 kB)243Collecting ruff244 Downloading ruff-0.9.6-py3-none-manylinux_2_17_x86_64.manylinux2014_x86_64.whl.metadata (25 kB)245Collecting flake8246 Downloading flake8-7.1.2-py2.py3-none-any.whl.metadata (3.8 kB)247Collecting pyfakefs248 Downloading pyfakefs-5.7.4-py3-none-any.whl.metadata (7.8 kB)249Collecting keyring250 Downloading keyring-25.6.0-py3-none-any.whl.metadata (20 kB)251Collecting dill>=0.2 (from pylint)252 Downloading dill-0.3.9-py3-none-any.whl.metadata (10 kB)253Requirement already satisfied: platformdirs>=2.2.0 in /home/travis/virtualenv/python3.10.14/lib/python3.10/site-packages (from pylint) (4.2.0)254Collecting astroid<=3.4.0-dev0,>=3.3.8 (from pylint)255 Downloading astroid-3.3.8-py3-none-any.whl.metadata (4.5 kB)256Collecting isort!=5.13.0,<7,>=4.2.5 (from pylint)257 Downloading isort-6.0.0-py3-none-any.whl.metadata (11 kB)258Collecting mccabe<0.8,>=0.6 (from pylint)259 Downloading mccabe-0.7.0-py2.py3-none-any.whl.metadata (5.0 kB)260Requirement already satisfied: tomli>=1.1.0 in /home/travis/virtualenv/python3.10.14/lib/python3.10/site-packages (from pylint) (2.0.1)261Collecting tomlkit>=0.10.1 (from pylint)262 Downloading tomlkit-0.13.2-py3-none-any.whl.metadata (2.7 kB)263Collecting pycodestyle<2.13.0,>=2.12.0 (from flake8)264 Downloading pycodestyle-2.12.1-py2.py3-none-any.whl.metadata (4.5 kB)265Collecting pyflakes<3.3.0,>=3.2.0 (from flake8)266 Downloading pyflakes-3.2.0-py2.py3-none-any.whl.metadata (3.5 kB)267Collecting SecretStorage>=3.2 (from keyring)268 Downloading SecretStorage-3.3.3-py3-none-any.whl.metadata (4.0 kB)269Collecting jeepney>=0.4.2 (from keyring)270 Downloading jeepney-0.8.0-py3-none-any.whl.metadata (1.3 kB)271Collecting importlib_metadata>=4.11.4 (from keyring)272 Downloading importlib_metadata-8.6.1-py3-none-any.whl.metadata (4.7 kB)273Collecting jaraco.classes (from keyring)274 Downloading jaraco.classes-3.4.0-py3-none-any.whl.metadata (2.6 kB)275Collecting jaraco.functools (from keyring)276 Downloading jaraco.functools-4.1.0-py3-none-any.whl.metadata (2.9 kB)277Collecting jaraco.context (from keyring)278 Downloading jaraco.context-6.0.1-py3-none-any.whl.metadata (4.1 kB)279Collecting typing-extensions>=4.0.0 (from astroid<=3.4.0-dev0,>=3.3.8->pylint)280 Downloading typing_extensions-4.12.2-py3-none-any.whl.metadata (3.0 kB)281Collecting zipp>=3.20 (from importlib_metadata>=4.11.4->keyring)282 Downloading zipp-3.21.0-py3-none-any.whl.metadata (3.7 kB)283Collecting cryptography>=2.0 (from SecretStorage>=3.2->keyring)284 Downloading cryptography-44.0.1-cp39-abi3-manylinux_2_34_x86_64.whl.metadata (5.7 kB)285Collecting more-itertools (from jaraco.classes->keyring)286 Downloading more_itertools-10.6.0-py3-none-any.whl.metadata (37 kB)287Collecting backports.tarfile (from jaraco.context->keyring)288 Downloading backports.tarfile-1.2.0-py3-none-any.whl.metadata (2.0 kB)289Collecting cffi>=1.12 (from cryptography>=2.0->SecretStorage>=3.2->keyring)290 Downloading cffi-1.17.1-cp310-cp310-manylinux_2_17_x86_64.manylinux2014_x86_64.whl.metadata (1.5 kB)291Collecting pycparser (from cffi>=1.12->cryptography>=2.0->SecretStorage>=3.2->keyring)292 Downloading pycparser-2.22-py3-none-any.whl.metadata (943 bytes)293Downloading pylint-3.3.4-py3-none-any.whl (522 kB)294Downloading ruff-0.9.6-py3-none-manylinux_2_17_x86_64.manylinux2014_x86_64.whl (12.5 MB)295Downloading flake8-7.1.2-py2.py3-none-any.whl (57 kB)296Downloading pyfakefs-5.7.4-py3-none-any.whl (228 kB)297Downloading keyring-25.6.0-py3-none-any.whl (39 kB)298Downloading astroid-3.3.8-py3-none-any.whl (275 kB)299Downloading dill-0.3.9-py3-none-any.whl (119 kB)300Downloading importlib_metadata-8.6.1-py3-none-any.whl (26 kB)301Downloading isort-6.0.0-py3-none-any.whl (94 kB)302Downloading jeepney-0.8.0-py3-none-any.whl (48 kB)303Downloading mccabe-0.7.0-py2.py3-none-any.whl (7.3 kB)304Downloading pycodestyle-2.12.1-py2.py3-none-any.whl (31 kB)305Downloading pyflakes-3.2.0-py2.py3-none-any.whl (62 kB)306Downloading SecretStorage-3.3.3-py3-none-any.whl (15 kB)307Downloading tomlkit-0.13.2-py3-none-any.whl (37 kB)308Downloading jaraco.classes-3.4.0-py3-none-any.whl (6.8 kB)309Downloading jaraco.context-6.0.1-py3-none-any.whl (6.8 kB)310Downloading jaraco.functools-4.1.0-py3-none-any.whl (10 kB)311Downloading cryptography-44.0.1-cp39-abi3-manylinux_2_34_x86_64.whl (4.2 MB)312Downloading typing_extensions-4.12.2-py3-none-any.whl (37 kB)313Downloading zipp-3.21.0-py3-none-any.whl (9.6 kB)314Downloading backports.tarfile-1.2.0-py3-none-any.whl (30 kB)315Downloading more_itertools-10.6.0-py3-none-any.whl (63 kB)316Downloading cffi-1.17.1-cp310-cp310-manylinux_2_17_x86_64.manylinux2014_x86_64.whl (446 kB)317Downloading pycparser-2.22-py3-none-any.whl (117 kB)318Installing collected packages: zipp, typing-extensions, tomlkit, ruff, pyflakes, pyfakefs, pycparser, pycodestyle, more-itertools, mccabe, jeepney, isort, dill, backports.tarfile, jaraco.functools, jaraco.context, jaraco.classes, importlib_metadata, flake8, cffi, astroid, pylint, cryptography, SecretStorage, keyring319Successfully installed SecretStorage-3.3.3 astroid-3.3.8 backports.tarfile-1.2.0 cffi-1.17.1 cryptography-44.0.1 dill-0.3.9 flake8-7.1.2 importlib_metadata-8.6.1 isort-6.0.0 jaraco.classes-3.4.0 jaraco.context-6.0.1 jaraco.functools-4.1.0 jeepney-0.8.0 keyring-25.6.0 mccabe-0.7.0 more-itertools-10.6.0 pycodestyle-2.12.1 pycparser-2.22 pyfakefs-5.7.4 pyflakes-3.2.0 pylint-3.3.4 ruff-0.9.6 tomlkit-0.13.2 typing-extensions-4.12.2 zipp-3.21.0install.3321Collecting pyqt6322 Downloading PyQt6-6.8.1-cp39-abi3-manylinux_2_28_x86_64.whl.metadata (2.1 kB)323Collecting dbus-python324 Downloading dbus-python-1.3.2.tar.gz (605 kB)325 Installing build dependencies ... done326 Getting requirements to build wheel ... done327 Preparing metadata (pyproject.toml) ... done328Collecting PyQt6-sip<14,>=13.8 (from pyqt6)329 Downloading PyQt6_sip-13.10.0-cp310-cp310-manylinux_2_5_x86_64.manylinux1_x86_64.whl.metadata (472 bytes)330Collecting PyQt6-Qt6<6.9.0,>=6.8.0 (from pyqt6)331 Downloading PyQt6_Qt6-6.8.2-py3-none-manylinux_2_28_x86_64.whl.metadata (534 bytes)332Downloading PyQt6-6.8.1-cp39-abi3-manylinux_2_28_x86_64.whl (8.2 MB)333Downloading PyQt6_Qt6-6.8.2-py3-none-manylinux_2_28_x86_64.whl (81.3 MB)334Downloading PyQt6_sip-13.10.0-cp310-cp310-manylinux_2_5_x86_64.manylinux1_x86_64.whl (283 kB)335Building wheels for collected packages: dbus-python336 Building wheel for dbus-python (pyproject.toml) ... done337 Created wheel for dbus-python: filename=dbus_python-1.3.2-cp310-cp310-linux_x86_64.whl size=121900 sha256=a3a3547496d7a6440377f31fe44e25e1e7c8b8bb7bb73b3505638660210cd699338 Stored in directory: /home/travis/.cache/pip/wheels/c8/53/b5/e4afbee894a48133d20f9ff9842a0083b0428af33a10d7a712339Successfully built dbus-python340Installing collected packages: PyQt6-Qt6, PyQt6-sip, dbus-python, pyqt6341Successfully installed PyQt6-Qt6-6.8.2 PyQt6-sip-13.10.0 dbus-python-1.3.2 pyqt6-6.8.1install.4343Generating public/private rsa key pair.344Your identification has been saved in /home/travis/.ssh/id_rsa345Your public key has been saved in /home/travis/.ssh/id_rsa.pub346The key fingerprint is:347SHA256:LJzCBDbDambgUWw52h4/z4vtDvNYKrS1My/t5GCEB2A travis@travis-job-e5484f5a-bbb0-401c-a3a6-5c83a4aa6bc4348The key's randomart image is:349+---[RSA 2048]----+350| EB.. |351|oooO |352|o.=.o |353|.* =o. o |354|+ ..=o+ S |355| oo= . |356| . o=*o |357| o.=&+ |358| .+OX. |359+----[SHA256]-----+install.5364Listing 'common'...365Compiling 'common/applicationinstance.py'...366Compiling 'common/askpass.py'...367Compiling 'common/backintime.py'...368Listing 'common/bash-completion'...369Compiling 'common/bcolors.py'...370Compiling 'common/bitbase.py'...371Compiling 'common/cli.py'...372Compiling 'common/config.py'...373Compiling 'common/configfile.py'...374Compiling 'common/daemon.py'...375Compiling 'common/diagnostics.py'...376Listing 'common/doc-dev'...377Listing 'common/doc-dev/_static'...378Listing 'common/doc-dev/_templates'...379Compiling 'common/doc-dev/conf.py'...380Listing 'common/doc-dev/plugins'...381Compiling 'common/encfstools.py'...382Compiling 'common/encode.py'...383Compiling 'common/exceptions.py'...384Compiling 'common/flock.py'...385Compiling 'common/guiapplicationinstance.py'...386Compiling 'common/languages.py'...387Compiling 'common/logger.py'...388Listing 'common/man'...389Listing 'common/man/C'...390Compiling 'common/mount.py'...391Compiling 'common/password.py'...392Compiling 'common/password_ipc.py'...393Compiling 'common/pluginmanager.py'...394Listing 'common/plugins'...395Compiling 'common/plugins/usercallbackplugin.py'...396Listing 'common/po'...397Compiling 'common/progress.py'...398Compiling 'common/qt_probing.py'...399Compiling 'common/schedule.py'...400Compiling 'common/singleton.py'...401Compiling 'common/snapshotlog.py'...402Compiling 'common/snapshots.py'...403Compiling 'common/ssh_max_arg.py'...404Compiling 'common/sshtools.py'...405Listing 'common/test'...406Compiling 'common/test/__init__.py'...407Compiling 'common/test/constants.py'...408Compiling 'common/test/generic.py'...409Compiling 'common/test/test_applicationinstance.py'...410Compiling 'common/test/test_argparser.py'...411Compiling 'common/test/test_backintime.py'...412Compiling 'common/test/test_backup.py'...413Compiling 'common/test/test_config.py'...414Compiling 'common/test/test_config_crontab.py'...415Compiling 'common/test/test_configfile.py'...416Compiling 'common/test/test_diagnostics.py'...417Compiling 'common/test/test_encfstools.py'...418Compiling 'common/test/test_languages.py'...419Compiling 'common/test/test_lint.py'...420Compiling 'common/test/test_mount.py'...421Compiling 'common/test/test_plugin_usercallback.py'...422Compiling 'common/test/test_restore.py'...423Compiling 'common/test/test_schedule.py'...424Compiling 'common/test/test_sid.py'...425Compiling 'common/test/test_singleton.py'...426Compiling 'common/test/test_snapshotlog.py'...427Compiling 'common/test/test_snapshots.py'...428Compiling 'common/test/test_snapshots_autoremove.py'...429Compiling 'common/test/test_sshtools.py'...430Compiling 'common/test/test_takeSnapshot.py'...431Compiling 'common/test/test_tools.py'...432Compiling 'common/test/test_uniquenessset.py'...433Compiling 'common/tools.py'...434Compiling 'common/uniquenessset.py'...435Compiling 'common/version.py'...436Listing 'common/test'...437Listing 'common/plugins'...438Listing 'qt'...439Compiling 'qt/aboutdlg.py'...440Compiling 'qt/app.py'...441Compiling 'qt/editusercallback.py'...442Compiling 'qt/encfsmsgbox.py'...443Compiling 'qt/icon.py'...444Listing 'qt/icons'...445Listing 'qt/icons/16x16'...446Listing 'qt/icons/16x16/actions'...447Listing 'qt/icons/22x22'...448Listing 'qt/icons/22x22/actions'...449Listing 'qt/icons/24x24'...450Listing 'qt/icons/24x24/actions'...451Listing 'qt/icons/32x32'...452Listing 'qt/icons/32x32/actions'...453Listing 'qt/icons/48x48'...454Listing 'qt/icons/48x48/actions'...455Listing 'qt/icons/scalable'...456Listing 'qt/icons/scalable/actions'...457Compiling 'qt/languagedialog.py'...458Compiling 'qt/logviewdialog.py'...459Listing 'qt/man'...460Listing 'qt/man/C'...461Listing 'qt/manageprofiles'...462Compiling 'qt/manageprofiles/__init__.py'...463Compiling 'qt/manageprofiles/combobox.py'...464Compiling 'qt/manageprofiles/schedulewidget.py'...465Compiling 'qt/manageprofiles/spinboxunit.py'...466Compiling 'qt/manageprofiles/sshproxywidget.py'...467Compiling 'qt/manageprofiles/statebindcheckbox.py'...468Compiling 'qt/manageprofiles/tab_expert_options.py'...469Compiling 'qt/manageprofiles/tab_general.py'...470Compiling 'qt/manageprofiles/tab_options.py'...471Compiling 'qt/manageprofiles/tab_remove_retention.py'...472Compiling 'qt/messagebox.py'...473Listing 'qt/plugins'...474Compiling 'qt/plugins/notifyplugin.py'...475Compiling 'qt/plugins/systrayiconplugin.py'...476Compiling 'qt/qtsystrayicon.py'...477Compiling 'qt/qttools.py'...478Compiling 'qt/qttools_path.py'...479Compiling 'qt/restoreconfigdialog.py'...480Compiling 'qt/restoredialog.py'...481Compiling 'qt/serviceHelper.py'...482Compiling 'qt/snapshotsdialog.py'...483Compiling 'qt/statedata.py'...484Listing 'qt/test'...485Compiling 'qt/test/__init__.py'...486Compiling 'qt/test/test_lint.py'...487Compiling 'qt/test/test_statedata.py'...488Compiling 'qt/usermessagedialog.py'...489Listing 'qt/test'...490Listing 'qt/plugins'...491The command "python -m compileall common common/test common/plugins qt qt/test qt/plugins" exited with 0.493The command "cd common" exited with 0.495Replacement of python path with "/usr/bin/python3" successful.496All OK. Now run:497 make498 sudo make install499The command "./configure" exited with 0.501/home/travis/virtualenv/python3.10.14/bin/pytest -v502============================= test session starts ==============================503platform linux -- Python 3.10.14, pytest-8.1.1, pluggy-1.4.0 -- /home/travis/virtualenv/python3.10.14/bin/python504cachedir: .pytest_cache505rootdir: /home/travis/build/bit-team/backintime/common506plugins: pyfakefs-5.7.4507collected 426 items513test/test_applicationinstance.py::General::test_existing_process_with_correct_proc_cmdline PASSED [ 1%]514test/test_applicationinstance.py::General::test_existing_process_with_correct_procname PASSED [ 1%]516test/test_applicationinstance.py::General::test_existing_process_with_wrong_procname PASSED [ 1%]608test/test_configfile.py::TestConfigFile::test_remove_keys_start_with_not_matching_prefix PASSED [ 23%]614test/test_configfile.py::TestConfigFile::test_setListValue_invalid_type_for_type_key PASSED [ 24%]638test/test_configfile.py::TestConfigFileWithProfiles::test_removeProfileKeysStartsWith PASSED [ 30%]936=================================== FAILURES ===================================937______________ MirrorMirrorOnTheWall.test010_ruff_default_ruleset ______________939self = <test.test_lint.MirrorMirrorOnTheWall testMethod=test010_ruff_default_ruleset>941 @unittest.skipUnless(RUFF_AVAILABLE, BASE_REASON.format('ruff'))942 def test010_ruff_default_ruleset(self):943 """Ruff in default mode."""945 # ATTENTIION: Some settings are found in pyproject.toml946 cmd = [947 'ruff',948 'check',949 # Additionally activate subset of special rules:950 # - PyLint (PL)951 # - PyCodestyle (E, W)952 # - flake8-gettext (INT)953 # - useless noqua (RUF100)954 '--extend-select=PL,E,W,INT,RUF100',955 # Ignore: redefined-loop-name956 '--ignore=PLW2901',957 '--line-length', str(PEP8_MAX_LINE_LENGTH),958 # Because of globally installed GNU gettext functions959 '--config', 'builtins=["_", "ngettext"]',960 # Ruff counting branches different from PyLint.961 # See: <https://www.reddit.com/r/learnpython/comments/962 # 1buojae/comment/kxu0mp3>963 '--config', 'pylint.max-branches=13',964 '--config', 'flake8-quotes.inline-quotes = "single"',965 # one error per line (no context lines)966 '--output-format=concise',967 '--quiet',968 ]970 cmd.extend(full_test_files)972 proc = subprocess.run(973 cmd,974 check=False,975 universal_newlines=True,976 capture_output=True977 )979 # No errors other then linter rules980 self.assertIn(proc.returncode, [0, 1], proc.stderr)982 error_n = len(proc.stdout.splitlines())983 if error_n > 0:984 print(proc.stdout)986> self.assertEqual(0, error_n, f'Ruff found {error_n} problem(s).')987E AssertionError: 0 != 1 : Ruff found 1 problem(s).990----------------------------- Captured stdout call -----------------------------991test/test_mount.py:205:80: E501 Line too long (89 > 79)993_____________ MirrorMirrorOnTheWall.test020_flake8_default_ruleset _____________995self = <test.test_lint.MirrorMirrorOnTheWall testMethod=test020_flake8_default_ruleset>997 @unittest.skipUnless(FLAKE8_AVAILABLE, BASE_REASON.format('flake8'))998 def test020_flake8_default_ruleset(self):999 """Flake8 in default mode."""1000 cmd = [1001 'flake8',1002 f'--max-line-length={PEP8_MAX_LINE_LENGTH}',1003 '--builtins=_,ngettext',1004 # '--enable-extensions='1005 ]1007 cmd.extend(full_test_files)1009 proc = subprocess.run(1010 cmd,1011 check=False,1012 universal_newlines=True,1013 capture_output=True1014 )1016 error_n = len(proc.stdout.splitlines())1017 if error_n > 0:1018 print(proc.stdout)1020> self.assertEqual(0, error_n, f'Flake8 found {error_n} problem(s).')1021E AssertionError: 0 != 2 : Flake8 found 2 problem(s).1024----------------------------- Captured stdout call -----------------------------1025/home/travis/build/bit-team/backintime/common/test/test_mount.py:205:80: E501 line too long (89 > 79 characters)1026/home/travis/build/bit-team/backintime/common/test/test_mount.py:217:5: E303 too many blank lines (2)1028_____________ MirrorMirrorOnTheWall.test030_pylint_default_ruleset _____________1030self = <test.test_lint.MirrorMirrorOnTheWall testMethod=test030_pylint_default_ruleset>1032 @unittest.skipUnless(PYLINT_AVAILABLE, BASE_REASON.format('PyLint'))1033 def test030_pylint_default_ruleset(self):1034 """Use Pylint with all default rules to check specific files.1035 """1037 cmd = create_pylint_cmd()1039 # Add py-files1040 cmd.extend(full_test_files)1042 r = subprocess.run(1043 cmd,1044 check=False,1045 universal_newlines=True,1046 capture_output=True)1048 # Count lines except module headings1049 error_n = len(list(filter(lambda line: not line.startswith('*****'),1050 r.stdout.splitlines())))1051 print(r.stdout)1053> self.assertEqual(0, error_n, f'PyLint found {error_n} problems.')1054E AssertionError: 0 != 8 : PyLint found 8 problems.1057----------------------------- Captured stdout call -----------------------------1058************* Module test.test_mount1059test/test_mount.py:205:0: C0301: Line too long (89/79) (line-too-long)1060test/test_mount.py:217:4: C0116: Missing function or method docstring (missing-function-docstring)1061test/test_mount.py:217:4: C0103: Method name "test_first_preMountCheck" doesn't conform to snake_case naming style (invalid-name)1062test/test_mount.py:221:4: C0116: Missing function or method docstring (missing-function-docstring)1063test/test_mount.py:221:4: C0103: Method name "test_initialised_preMountCheck" doesn't conform to snake_case naming style (invalid-name)1064test/test_mount.py:225:4: C0116: Missing function or method docstring (missing-function-docstring)1065test/test_mount.py:229:4: C0116: Missing function or method docstring (missing-function-docstring)1066test/test_mount.py:232:4: C0116: Missing function or method docstring (missing-function-docstring)1068=========================== short test summary info ============================1069FAILED test/test_lint.py::MirrorMirrorOnTheWall::test010_ruff_default_ruleset - AssertionError: 0 != 1 : Ruff found 1 problem(s).1070FAILED test/test_lint.py::MirrorMirrorOnTheWall::test020_flake8_default_ruleset - AssertionError: 0 != 2 : Flake8 found 2 problem(s).1071FAILED test/test_lint.py::MirrorMirrorOnTheWall::test030_pylint_default_ruleset - AssertionError: 0 != 8 : PyLint found 8 problems.1073make: *** [Makefile:620: unittest-v] Error 11074The command "make unittest-v" exited with 2.1076The command "cd .." exited with 0.1078The command "cd qt" exited with 0.1080Replacement of python path with "/usr/bin/python3" successful.1081All OK. Now run:1082 make1083 sudo make install1084The command "./configure" exited with 0.1086# Man pages1087for i in $(ls -1 man/C/); do case $i in *.gz|*~) continue;; *) gzip -n --best -c man/C/$i > man/C/${i}.gz;; esac; done1088The command "make" exited with 0.1090============================= test session starts ==============================1091platform linux -- Python 3.10.14, pytest-8.1.1, pluggy-1.4.0 -- /home/travis/virtualenv/python3.10.14/bin/python1092cachedir: .pytest_cache1093rootdir: /home/travis/build/bit-team/backintime/qt1094plugins: pyfakefs-5.7.41095collected 9 items1108The command "pytest --verbose" exited with 0.1111Done. Your build exited with 1.