AMD64
no language set
Git
Scroll to End of Log
0.16s0.10s3.11 is not installed; attempting download0.06s0.00sTopworker_info1Worker information2hostname: 4f5ae88f-b560-403d-b336-62325d12e21c@1.worker-com-oss-6ff4ffc9b7-t9rhk.gce-production-33version: v6.2.24 https://github.com/travis-ci/worker/tree/ee57d650a7692c1ac03f74ac073d0fd150c9f0304instance: travis-job-32ccb9fc-3c18-4667-abbb-399d2febee25 travis-ci-ubuntu-2204-1732291639-53689d97 (via amqp)5startup: 5.918324107ssystem_info7Build system information8Build language: python9Build dist: jammy10Build id: 27424859611Job id: 63066344212Runtime kernel version: 6.8.0-1018-gcp13VM: default14travis-build version: 6b157a1c15Build image provisioning date and time16Fri Nov 22 04:28:26 PM UTC 202417Operating System Details18Distributor ID: Ubuntu19Description: Ubuntu 22.04.5 LTS20Release: 22.0421Codename: jammy22Systemd Version23systemd 249 (249.11-0ubuntu3.12)24Cookbooks Version25be2ab50 https://github.com/travis-ci/travis-cookbooks/tree/be2ab5026git version27git version 2.47.028bash version29GNU bash, version 5.1.16(1)-release (x86_64-pc-linux-gnu)30gcc version31gcc (Ubuntu 11.4.0-1ubuntu1~22.04) 11.4.032docker version33Client:34 Version: 24.0.735 API version: 1.4336 Go version: go1.21.137 Git commit: 24.0.7-0ubuntu2~22.04.138 Built: Wed Mar 13 20:23:54 202439 OS/Arch: linux/amd6440 Context: default42Server:43 Engine:44 Version: 24.0.745 API version: 1.43 (minimum version 1.12)46 Go version: go1.21.147 Git commit: 24.0.7-0ubuntu2~22.04.148 Built: Wed Mar 13 20:23:54 202449 OS/Arch: linux/amd6450 Experimental: false51 containerd:52 Version: 1.7.1253 GitCommit:54 runc:55 Version: 1.1.12-0ubuntu2~22.04.156 GitCommit:57 docker-init:58 Version: 0.19.059 GitCommit:60clang version61clang version 18.1.862jq version63jq-1.7.164bats version65Bats 1.11.066shellcheck version670.10.068shfmt version69v3.8.070ccache version714.5.172cmake version73cmake version 3.29.074heroku version75heroku/9.5.0 linux-x64 node-v16.20.276imagemagick version77Version: ImageMagick 6.9.11-60 Q16 x86_64 2021-01-25 https://imagemagick.org78md5deep version794.480mercurial version81version 6.5.282mysql version83mysql Ver 8.0.40-0ubuntu0.22.04.1 for Linux on x86_64 ((Ubuntu))84openssl version85OpenSSL 3.0.2 15 Mar 2022 (Library: OpenSSL 3.0.2 15 Mar 2022)86packer version87Packer v1.11.288postgresql client version89psql (PostgreSQL) 14.13 (Ubuntu 14.13-0ubuntu0.22.04.1)90ragel version91Ragel State Machine Compiler version 6.10 March 201792sudo version931.9.994gzip version95gzip 1.1096zip version97Zip 3.098vim version99VIM - Vi IMproved 8.2 (2019 Dec 12, compiled Oct 16 2024 17:27:14)100iptables version101iptables v1.8.7 (nf_tables)102curl version103curl 7.81.0 (x86_64-pc-linux-gnu) libcurl/7.81.0 OpenSSL/3.0.2 zlib/1.2.11 brotli/1.0.9 zstd/1.4.8 libidn2/2.3.2 libpsl/0.21.0 (+libidn2/2.3.2) libssh/0.9.6/openssl/zlib nghttp2/1.43.0 librtmp/2.3 OpenLDAP/2.5.18104wget version105GNU Wget 1.21.2 built on linux-gnu.106rsync version107rsync version 3.2.7 protocol version 31108nvm version1090.40.1110perlbrew version111/home/travis/perl5/perlbrew/bin/perlbrew - App::perlbrew/0.95112phpenv version113rbenv 1.3.0114rvm version115rvm 1.29.12 (latest) by Michal Papis, Piotr Kuczynski, Wayne E. Seguin [https://rvm.io]116default ruby version117ruby 3.3.5 (2024-09-03 revision ef084cc8f4) [x86_64-linux]118default python version119Python 3.10.14120ElasticSearch version1217.16.3122Installed Firefox version123firefox 99.0124MongoDB version125MongoDB 6.0.19126ant version127Apache Ant(TM) version 1.10.12 compiled on January 17 1970128mvn version129Apache Maven 3.9.4 (dfbb324ad4a7c8fb0bf182e6d91b0ae20e3d2dd9)130gradle version131Gradle 8.3!132lein version133Leiningen 2.11.2 on Java 11.0.21 OpenJDK 64-Bit Server VM134Pre-installed Node.js versions135v10.24.1136v12.22.12137v14.21.3138v16.15139v16.20.2140v18.20.3141v18.20.5142v20.18.1143v22.11.0144v4.9.1145v6.17.1146v8.17.0147phpenv versions148 system149 8.1150* 8.1.2 (set by /home/travis/.phpenv/version)151 hhvm-stable152 hhvm153composer --version154Composer version 2.3.7 2022-06-06 16:43:28155Pre-installed Ruby versions156ruby-2.7.8157ruby-3.3.51600.00s0.05s0.00s0.01s0.12s0.00s0.00s0.00s0.01s0.00s0.11s0.00s0.86s0.00s0.00s18.73s0.00s3.11s0.00s3.56sdocker_mtu_and_registry_mirrorsDockerresolvconf161Downloading archive: https://storage.googleapis.com/travis-ci-language-archives/python/binaries/ubuntu/22.04/x86_64/python-3.11.tar.bz21640.00sssh_known_hosts.0165Adding ssh known hosts166$ mkdir -p ${TRAVIS_HOME}/.ssh1670.04s$ ssh-keyscan -t $TRAVIS_SSH_KEY_TYPES -H localhost 2>&1 | tee -a ${TRAVIS_HOME}/.ssh/known_hosts168# localhost:22 SSH-2.0-OpenSSH_8.9p1 Ubuntu-3ubuntu0.10169# localhost:22 SSH-2.0-OpenSSH_8.9p1 Ubuntu-3ubuntu0.10170# localhost:22 SSH-2.0-OpenSSH_8.9p1 Ubuntu-3ubuntu0.10171|1|QIXSxwW5QjbZMv8iyM02gPVRIRw=|0Q1jan4428wuaMMlnZUs9jotpGk= ssh-rsa AAAAB3NzaC1yc2EAAAADAQABAAABgQC3HFI6rtIj/GuMEyW1RTjiBc7+J7Vpt8P4SH+v052iAYR3E2U2zZLGrmdvSRbQlmT/gV35L078opxGKb+NYDnZ6pgeb9/id4k5UEKKtLriarKEchv1BtOhmwy+7dFV0sGqGMfcrUQDpFweJUThsiRMAFN+CguOsLIZBz6n5TIXAloW/jewoOtylEfINfTJEODKvaPl7gYORLYUpzLGuldjvyxos+FILF+Hsb38rOu1YLjWiEVk25KzQ1BHocZwk2Yin50wQHcm3JfXb95xFRGvJdCZGwICNAfr66u9tAXzG3eYOhd178trKl16GZZeXOXP7y0Sgw9GQFToBF+ybybZHq3zj5r0KTqyKatnh3ejg7K702pQpITKL+FtmHNg9SYWhSK1awwrdoTrVTNvEYF73OOxzX0cUEM24DwgXZ9IjULbaEXCRPL+zxuDMILjid/qLyWUE9zDf21CAiFI2jgwF6Zf+OnhuzpG+lvI2pR4Q2Ks1vfxchvchgCruCtSvVU=172|1|dRgmsyCHO6GtyyZmS+mkgLtrtZY=|mJY/HAyPldKHLOMX2XcJ18KjynE= ecdsa-sha2-nistp256 AAAAE2VjZHNhLXNoYTItbmlzdHAyNTYAAAAIbmlzdHAyNTYAAABBBMIe0gbM8XDsBJmBnij8+Cb/EpVgrtMJzR3JRv5h+tdVqFRtMiz5zud9VJwPN3Yke/gSetvEWasxJG2rHVLoupc=git.checkout175Cloning into 'bit-team/backintime'...176remote: Enumerating objects: 932, done.177remote: Counting objects: 100% (932/932), done.178remote: Compressing objects: 100% (559/559), done.179remote: Total 932 (delta 541), reused 631 (delta 344), pack-reused 0 (from 0)180Receiving objects: 100% (932/932), 4.82 MiB | 16.23 MiB/s, done.181Resolving deltas: 100% (541/541), done.182$ cd bit-team/backintime184remote: Enumerating objects: 43, done.185remote: Counting objects: 100% (38/38), done.186remote: Compressing objects: 100% (17/17), done.187remote: Total 29 (delta 22), reused 18 (delta 12), pack-reused 0 (from 0)188Unpacking objects: 100% (29/29), 4.63 KiB | 395.00 KiB/s, done.189From https://github.com/bit-team/backintime190 * branch refs/pull/2039/merge -> FETCH_HEAD191$ git checkout -qf FETCH_HEAD1930.00s194Setting environment variables from .travis.yml195$ export PYTHONUNBUFFERED=1198$ python --version199Python 3.11.9200$ pip --version201pip 24.1.2 from /home/travis/virtualenv/python3.11.9/lib/python3.11/site-packages/pip (python 3.11)before_install.1before_install.2204Warning: apt-key is deprecated. Manage keyring files in trusted.gpg.d instead (see apt-key(8)).205OKbefore_install.3207W: http://package.perforce.com/apt/ubuntu/dists/jammy/InRelease: Key is stored in legacy trusted.gpg keyring (/etc/apt/trusted.gpg), see the DEPRECATION section in apt-key(8) for details.208W: http://apt.postgresql.org/pub/repos/apt/dists/jammy-pgdg/InRelease: Key is stored in legacy trusted.gpg keyring (/etc/apt/trusted.gpg), see the DEPRECATION section in apt-key(8) for details.before_install.4210Reading package lists... Done211Building dependency tree... Done212Reading state information... Done213screen is already the newest version (4.9.0-1).214libdbus-1-dev is already the newest version (1.12.20-2ubuntu4.1).215util-linux is already the newest version (2.37.2-4ubuntu3.4).216The following NEW packages will be installed:217 sshfs2180 upgraded, 1 newly installed, 0 to remove and 134 not upgraded.219Need to get 45.1 kB of archives.220After this operation, 126 kB of additional disk space will be used.221Get:1 http://archive.ubuntu.com/ubuntu jammy/universe amd64 sshfs amd64 3.7.1+repack-2 [45.1 kB]222Fetched 45.1 kB in 0s (362 kB/s)223Selecting previously unselected package sshfs.224(Reading database ... 132481 files and directories currently installed.)225Preparing to unpack .../sshfs_3.7.1+repack-2_amd64.deb ...226Unpacking sshfs (3.7.1+repack-2) ...227Setting up sshfs (3.7.1+repack-2) ...228Processing triggers for man-db (2.10.2-1) ...229NEEDRESTART-VER: 3.5230NEEDRESTART-KCUR: 6.8.0-1018-gcp231NEEDRESTART-KEXP: 6.8.0-1018-gcp232NEEDRESTART-KSTA: 1install.1234Requirement already satisfied: pip in /home/travis/virtualenv/python3.11.9/lib/python3.11/site-packages (24.1.2)235Collecting pip236 Downloading pip-25.0.1-py3-none-any.whl.metadata (3.7 kB)237Downloading pip-25.0.1-py3-none-any.whl (1.8 MB)238Installing collected packages: pip239 Attempting uninstall: pip240 Found existing installation: pip 24.1.2241 Uninstalling pip-24.1.2:242 Successfully uninstalled pip-24.1.2243Successfully installed pip-25.0.1install.2245Collecting pylint246 Downloading pylint-3.3.4-py3-none-any.whl.metadata (12 kB)247Collecting ruff248 Downloading ruff-0.9.6-py3-none-manylinux_2_17_x86_64.manylinux2014_x86_64.whl.metadata (25 kB)249Collecting flake8250 Downloading flake8-7.1.2-py2.py3-none-any.whl.metadata (3.8 kB)251Collecting pyfakefs252 Downloading pyfakefs-5.7.4-py3-none-any.whl.metadata (7.8 kB)253Collecting keyring254 Downloading keyring-25.6.0-py3-none-any.whl.metadata (20 kB)255Collecting dill>=0.3.6 (from pylint)256 Downloading dill-0.3.9-py3-none-any.whl.metadata (10 kB)257Requirement already satisfied: platformdirs>=2.2.0 in /home/travis/virtualenv/python3.11.9/lib/python3.11/site-packages (from pylint) (4.2.2)258Collecting astroid<=3.4.0-dev0,>=3.3.8 (from pylint)259 Downloading astroid-3.3.8-py3-none-any.whl.metadata (4.5 kB)260Collecting isort!=5.13.0,<7,>=4.2.5 (from pylint)261 Downloading isort-6.0.0-py3-none-any.whl.metadata (11 kB)262Collecting mccabe<0.8,>=0.6 (from pylint)263 Downloading mccabe-0.7.0-py2.py3-none-any.whl.metadata (5.0 kB)264Collecting tomlkit>=0.10.1 (from pylint)265 Downloading tomlkit-0.13.2-py3-none-any.whl.metadata (2.7 kB)266Collecting pycodestyle<2.13.0,>=2.12.0 (from flake8)267 Downloading pycodestyle-2.12.1-py2.py3-none-any.whl.metadata (4.5 kB)268Collecting pyflakes<3.3.0,>=3.2.0 (from flake8)269 Downloading pyflakes-3.2.0-py2.py3-none-any.whl.metadata (3.5 kB)270Collecting SecretStorage>=3.2 (from keyring)271 Downloading SecretStorage-3.3.3-py3-none-any.whl.metadata (4.0 kB)272Collecting jeepney>=0.4.2 (from keyring)273 Downloading jeepney-0.8.0-py3-none-any.whl.metadata (1.3 kB)274Collecting importlib_metadata>=4.11.4 (from keyring)275 Downloading importlib_metadata-8.6.1-py3-none-any.whl.metadata (4.7 kB)276Collecting jaraco.classes (from keyring)277 Downloading jaraco.classes-3.4.0-py3-none-any.whl.metadata (2.6 kB)278Collecting jaraco.functools (from keyring)279 Downloading jaraco.functools-4.1.0-py3-none-any.whl.metadata (2.9 kB)280Collecting jaraco.context (from keyring)281 Downloading jaraco.context-6.0.1-py3-none-any.whl.metadata (4.1 kB)282Collecting zipp>=3.20 (from importlib_metadata>=4.11.4->keyring)283 Downloading zipp-3.21.0-py3-none-any.whl.metadata (3.7 kB)284Collecting cryptography>=2.0 (from SecretStorage>=3.2->keyring)285 Downloading cryptography-44.0.1-cp39-abi3-manylinux_2_34_x86_64.whl.metadata (5.7 kB)286Collecting more-itertools (from jaraco.classes->keyring)287 Downloading more_itertools-10.6.0-py3-none-any.whl.metadata (37 kB)288Collecting backports.tarfile (from jaraco.context->keyring)289 Downloading backports.tarfile-1.2.0-py3-none-any.whl.metadata (2.0 kB)290Collecting cffi>=1.12 (from cryptography>=2.0->SecretStorage>=3.2->keyring)291 Downloading cffi-1.17.1-cp311-cp311-manylinux_2_17_x86_64.manylinux2014_x86_64.whl.metadata (1.5 kB)292Collecting pycparser (from cffi>=1.12->cryptography>=2.0->SecretStorage>=3.2->keyring)293 Downloading pycparser-2.22-py3-none-any.whl.metadata (943 bytes)294Downloading pylint-3.3.4-py3-none-any.whl (522 kB)295Downloading ruff-0.9.6-py3-none-manylinux_2_17_x86_64.manylinux2014_x86_64.whl (12.5 MB)296Downloading flake8-7.1.2-py2.py3-none-any.whl (57 kB)297Downloading pyfakefs-5.7.4-py3-none-any.whl (228 kB)298Downloading keyring-25.6.0-py3-none-any.whl (39 kB)299Downloading astroid-3.3.8-py3-none-any.whl (275 kB)300Downloading dill-0.3.9-py3-none-any.whl (119 kB)301Downloading importlib_metadata-8.6.1-py3-none-any.whl (26 kB)302Downloading isort-6.0.0-py3-none-any.whl (94 kB)303Downloading jeepney-0.8.0-py3-none-any.whl (48 kB)304Downloading mccabe-0.7.0-py2.py3-none-any.whl (7.3 kB)305Downloading pycodestyle-2.12.1-py2.py3-none-any.whl (31 kB)306Downloading pyflakes-3.2.0-py2.py3-none-any.whl (62 kB)307Downloading SecretStorage-3.3.3-py3-none-any.whl (15 kB)308Downloading tomlkit-0.13.2-py3-none-any.whl (37 kB)309Downloading jaraco.classes-3.4.0-py3-none-any.whl (6.8 kB)310Downloading jaraco.context-6.0.1-py3-none-any.whl (6.8 kB)311Downloading jaraco.functools-4.1.0-py3-none-any.whl (10 kB)312Downloading cryptography-44.0.1-cp39-abi3-manylinux_2_34_x86_64.whl (4.2 MB)313Downloading zipp-3.21.0-py3-none-any.whl (9.6 kB)314Downloading backports.tarfile-1.2.0-py3-none-any.whl (30 kB)315Downloading more_itertools-10.6.0-py3-none-any.whl (63 kB)316Downloading cffi-1.17.1-cp311-cp311-manylinux_2_17_x86_64.manylinux2014_x86_64.whl (467 kB)317Downloading pycparser-2.22-py3-none-any.whl (117 kB)318Installing collected packages: zipp, tomlkit, ruff, pyflakes, pyfakefs, pycparser, pycodestyle, more-itertools, mccabe, jeepney, isort, dill, backports.tarfile, astroid, pylint, jaraco.functools, jaraco.context, jaraco.classes, importlib_metadata, flake8, cffi, cryptography, SecretStorage, keyring319Successfully installed SecretStorage-3.3.3 astroid-3.3.8 backports.tarfile-1.2.0 cffi-1.17.1 cryptography-44.0.1 dill-0.3.9 flake8-7.1.2 importlib_metadata-8.6.1 isort-6.0.0 jaraco.classes-3.4.0 jaraco.context-6.0.1 jaraco.functools-4.1.0 jeepney-0.8.0 keyring-25.6.0 mccabe-0.7.0 more-itertools-10.6.0 pycodestyle-2.12.1 pycparser-2.22 pyfakefs-5.7.4 pyflakes-3.2.0 pylint-3.3.4 ruff-0.9.6 tomlkit-0.13.2 zipp-3.21.0install.3321Collecting pyqt6322 Downloading PyQt6-6.8.1-cp39-abi3-manylinux_2_28_x86_64.whl.metadata (2.1 kB)323Collecting dbus-python324 Downloading dbus-python-1.3.2.tar.gz (605 kB)325 Installing build dependencies ... done326 Getting requirements to build wheel ... done327 Preparing metadata (pyproject.toml) ... done328Collecting PyQt6-sip<14,>=13.8 (from pyqt6)329 Downloading PyQt6_sip-13.10.0-cp311-cp311-manylinux_2_5_x86_64.manylinux1_x86_64.whl.metadata (472 bytes)330Collecting PyQt6-Qt6<6.9.0,>=6.8.0 (from pyqt6)331 Downloading PyQt6_Qt6-6.8.2-py3-none-manylinux_2_28_x86_64.whl.metadata (534 bytes)332Downloading PyQt6-6.8.1-cp39-abi3-manylinux_2_28_x86_64.whl (8.2 MB)333Downloading PyQt6_Qt6-6.8.2-py3-none-manylinux_2_28_x86_64.whl (81.3 MB)334Downloading PyQt6_sip-13.10.0-cp311-cp311-manylinux_2_5_x86_64.manylinux1_x86_64.whl (293 kB)335Building wheels for collected packages: dbus-python336 Building wheel for dbus-python (pyproject.toml) ... done337 Created wheel for dbus-python: filename=dbus_python-1.3.2-cp311-cp311-linux_x86_64.whl size=121954 sha256=d0ee080b4cedfebfd6a4ca4a6eb761566fa348be53ec6067c539c72c9117da0b338 Stored in directory: /home/travis/.cache/pip/wheels/84/33/c2/bb34ffd273446cb228d2154aa702365159f5a7dcc5278584ce339Successfully built dbus-python340Installing collected packages: PyQt6-Qt6, PyQt6-sip, dbus-python, pyqt6341Successfully installed PyQt6-Qt6-6.8.2 PyQt6-sip-13.10.0 dbus-python-1.3.2 pyqt6-6.8.1install.4343Generating public/private rsa key pair.344Your identification has been saved in /home/travis/.ssh/id_rsa345Your public key has been saved in /home/travis/.ssh/id_rsa.pub346The key fingerprint is:347SHA256:5x6y/lDXNlvVgEYCUYkJxVK3uyAd4FA0PcUGfx121KQ travis@travis-job-32ccb9fc-3c18-4667-abbb-399d2febee25348The key's randomart image is:349+---[RSA 2048]----+350| .o***X=o..+o=|351| o.o*o+ooo =o|352| ...oo.. E o|353| . . o . .|354| . S + . + .|355| . = o . + |356| o + . |357| = . |358| .o.o |359+----[SHA256]-----+install.5364Listing 'common'...365Compiling 'common/applicationinstance.py'...366Compiling 'common/askpass.py'...367Compiling 'common/backintime.py'...368Listing 'common/bash-completion'...369Compiling 'common/bcolors.py'...370Compiling 'common/bitbase.py'...371Compiling 'common/cli.py'...372Compiling 'common/config.py'...373Compiling 'common/configfile.py'...374Compiling 'common/daemon.py'...375Compiling 'common/diagnostics.py'...376Listing 'common/doc-dev'...377Listing 'common/doc-dev/_static'...378Listing 'common/doc-dev/_templates'...379Compiling 'common/doc-dev/conf.py'...380Listing 'common/doc-dev/plugins'...381Compiling 'common/encfstools.py'...382Compiling 'common/encode.py'...383Compiling 'common/exceptions.py'...384Compiling 'common/flock.py'...385Compiling 'common/guiapplicationinstance.py'...386Compiling 'common/languages.py'...387Compiling 'common/logger.py'...388Listing 'common/man'...389Listing 'common/man/C'...390Compiling 'common/mount.py'...391Compiling 'common/password.py'...392Compiling 'common/password_ipc.py'...393Compiling 'common/pluginmanager.py'...394Listing 'common/plugins'...395Compiling 'common/plugins/usercallbackplugin.py'...396Listing 'common/po'...397Compiling 'common/progress.py'...398Compiling 'common/qt_probing.py'...399Compiling 'common/schedule.py'...400Compiling 'common/singleton.py'...401Compiling 'common/snapshotlog.py'...402Compiling 'common/snapshots.py'...403Compiling 'common/ssh_max_arg.py'...404Compiling 'common/sshtools.py'...405Listing 'common/test'...406Compiling 'common/test/__init__.py'...407Compiling 'common/test/constants.py'...408Compiling 'common/test/generic.py'...409Compiling 'common/test/test_applicationinstance.py'...410Compiling 'common/test/test_argparser.py'...411Compiling 'common/test/test_backintime.py'...412Compiling 'common/test/test_backup.py'...413Compiling 'common/test/test_config.py'...414Compiling 'common/test/test_config_crontab.py'...415Compiling 'common/test/test_configfile.py'...416Compiling 'common/test/test_diagnostics.py'...417Compiling 'common/test/test_encfstools.py'...418Compiling 'common/test/test_languages.py'...419Compiling 'common/test/test_lint.py'...420Compiling 'common/test/test_mount.py'...421Compiling 'common/test/test_plugin_usercallback.py'...422Compiling 'common/test/test_restore.py'...423Compiling 'common/test/test_schedule.py'...424Compiling 'common/test/test_sid.py'...425Compiling 'common/test/test_singleton.py'...426Compiling 'common/test/test_snapshotlog.py'...427Compiling 'common/test/test_snapshots.py'...428Compiling 'common/test/test_snapshots_autoremove.py'...429Compiling 'common/test/test_sshtools.py'...430Compiling 'common/test/test_takeSnapshot.py'...431Compiling 'common/test/test_tools.py'...432Compiling 'common/test/test_uniquenessset.py'...433Compiling 'common/tools.py'...434Compiling 'common/uniquenessset.py'...435Compiling 'common/version.py'...436Listing 'common/test'...437Listing 'common/plugins'...438Listing 'qt'...439Compiling 'qt/aboutdlg.py'...440Compiling 'qt/app.py'...441Compiling 'qt/editusercallback.py'...442Compiling 'qt/encfsmsgbox.py'...443Compiling 'qt/icon.py'...444Listing 'qt/icons'...445Listing 'qt/icons/16x16'...446Listing 'qt/icons/16x16/actions'...447Listing 'qt/icons/22x22'...448Listing 'qt/icons/22x22/actions'...449Listing 'qt/icons/24x24'...450Listing 'qt/icons/24x24/actions'...451Listing 'qt/icons/32x32'...452Listing 'qt/icons/32x32/actions'...453Listing 'qt/icons/48x48'...454Listing 'qt/icons/48x48/actions'...455Listing 'qt/icons/scalable'...456Listing 'qt/icons/scalable/actions'...457Compiling 'qt/languagedialog.py'...458Compiling 'qt/logviewdialog.py'...459Listing 'qt/man'...460Listing 'qt/man/C'...461Listing 'qt/manageprofiles'...462Compiling 'qt/manageprofiles/__init__.py'...463Compiling 'qt/manageprofiles/combobox.py'...464Compiling 'qt/manageprofiles/schedulewidget.py'...465Compiling 'qt/manageprofiles/spinboxunit.py'...466Compiling 'qt/manageprofiles/sshproxywidget.py'...467Compiling 'qt/manageprofiles/statebindcheckbox.py'...468Compiling 'qt/manageprofiles/tab_expert_options.py'...469Compiling 'qt/manageprofiles/tab_general.py'...470Compiling 'qt/manageprofiles/tab_options.py'...471Compiling 'qt/manageprofiles/tab_remove_retention.py'...472Compiling 'qt/messagebox.py'...473Listing 'qt/plugins'...474Compiling 'qt/plugins/notifyplugin.py'...475Compiling 'qt/plugins/systrayiconplugin.py'...476Compiling 'qt/qtsystrayicon.py'...477Compiling 'qt/qttools.py'...478Compiling 'qt/qttools_path.py'...479Compiling 'qt/restoreconfigdialog.py'...480Compiling 'qt/restoredialog.py'...481Compiling 'qt/serviceHelper.py'...482Compiling 'qt/snapshotsdialog.py'...483Compiling 'qt/statedata.py'...484Listing 'qt/test'...485Compiling 'qt/test/__init__.py'...486Compiling 'qt/test/test_lint.py'...487Compiling 'qt/test/test_statedata.py'...488Compiling 'qt/usermessagedialog.py'...489Listing 'qt/test'...490Listing 'qt/plugins'...491The command "python -m compileall common common/test common/plugins qt qt/test qt/plugins" exited with 0.493The command "cd common" exited with 0.495Replacement of python path with "/usr/bin/python3" successful.496All OK. Now run:497 make498 sudo make install499The command "./configure" exited with 0.501/home/travis/virtualenv/python3.11.9/bin/pytest -v502============================= test session starts ==============================503platform linux -- Python 3.11.9, pytest-8.3.2, pluggy-1.5.0 -- /home/travis/virtualenv/python3.11.9/bin/python504cachedir: .pytest_cache505rootdir: /home/travis/build/bit-team/backintime/common506plugins: pyfakefs-5.7.4507collected 426 items513test/test_applicationinstance.py::General::test_existing_process_with_correct_proc_cmdline PASSED [ 1%]514test/test_applicationinstance.py::General::test_existing_process_with_correct_procname PASSED [ 1%]516test/test_applicationinstance.py::General::test_existing_process_with_wrong_procname PASSED [ 1%]608test/test_configfile.py::TestConfigFile::test_remove_keys_start_with_not_matching_prefix PASSED [ 23%]614test/test_configfile.py::TestConfigFile::test_setListValue_invalid_type_for_type_key PASSED [ 24%]638test/test_configfile.py::TestConfigFileWithProfiles::test_removeProfileKeysStartsWith PASSED [ 30%]936=================================== FAILURES ===================================937_____________ MirrorMirrorOnTheWall.test020_flake8_default_ruleset _____________939self = <test.test_lint.MirrorMirrorOnTheWall testMethod=test020_flake8_default_ruleset>941 @unittest.skipUnless(FLAKE8_AVAILABLE, BASE_REASON.format('flake8'))942 def test020_flake8_default_ruleset(self):943 """Flake8 in default mode."""944 cmd = [945 'flake8',946 f'--max-line-length={PEP8_MAX_LINE_LENGTH}',947 '--builtins=_,ngettext',948 # '--enable-extensions='949 ]951 cmd.extend(full_test_files)953 proc = subprocess.run(954 cmd,955 check=False,956 universal_newlines=True,957 capture_output=True958 )960 error_n = len(proc.stdout.splitlines())961 if error_n > 0:962 print(proc.stdout)964> self.assertEqual(0, error_n, f'Flake8 found {error_n} problem(s).')965E AssertionError: 0 != 1 : Flake8 found 1 problem(s).968----------------------------- Captured stdout call -----------------------------969/home/travis/build/bit-team/backintime/common/test/test_mount.py:220:5: E303 too many blank lines (2)971=========================== short test summary info ============================972FAILED test/test_lint.py::MirrorMirrorOnTheWall::test020_flake8_default_ruleset - AssertionError: 0 != 1 : Flake8 found 1 problem(s).974make: *** [Makefile:620: unittest-v] Error 1975The command "make unittest-v" exited with 2.977The command "cd .." exited with 0.979The command "cd qt" exited with 0.981Replacement of python path with "/usr/bin/python3" successful.982All OK. Now run:983 make984 sudo make install985The command "./configure" exited with 0.987# Man pages988for i in $(ls -1 man/C/); do case $i in *.gz|*~) continue;; *) gzip -n --best -c man/C/$i > man/C/${i}.gz;; esac; done989The command "make" exited with 0.991============================= test session starts ==============================992platform linux -- Python 3.11.9, pytest-8.3.2, pluggy-1.5.0 -- /home/travis/virtualenv/python3.11.9/bin/python993cachedir: .pytest_cache994rootdir: /home/travis/build/bit-team/backintime/qt995plugins: pyfakefs-5.7.4996collected 9 items1009The command "pytest --verbose" exited with 0.1012Done. Your build exited with 1.