Pull request event #2498.5 failed

  • Ran for
AMD64
Python: 3.13
Git
PYTHONUNBUFFERED=1
Raw log
Scroll to End of Log
0.19s0.10s3.13 is not installed; attempting download0.06s0.00s
worker_info
1Worker information
2hostname: bced5ae3-354a-441b-a424-9322214be5ae@1.worker-com-oss-6ff4ffc9b7-t9rhk.gce-production-3
3version: v6.2.24 https://github.com/travis-ci/worker/tree/ee57d650a7692c1ac03f74ac073d0fd150c9f030
4instance: travis-job-83968406-33df-4e4d-becf-0138d9654188 travis-ci-ubuntu-2204-1732291639-53689d97 (via amqp)
5startup: 5.884916323s
60.32s0.01s0.00s0.01s
system_info
7Build system information
8Build language: python
9Build dist: jammy
10Build id: 274248596
11Job id: 630663444
12Runtime kernel version: 6.8.0-1018-gcp
13VM: default
14travis-build version: 6b157a1c
15Build image provisioning date and time
16Fri Nov 22 04:28:26 PM UTC 2024
17Operating System Details
18Distributor ID: Ubuntu
19Description: Ubuntu 22.04.5 LTS
20Release: 22.04
21Codename: jammy
22Systemd Version
23systemd 249 (249.11-0ubuntu3.12)
24Cookbooks Version
25be2ab50 https://github.com/travis-ci/travis-cookbooks/tree/be2ab50
26git version
27git version 2.47.0
28bash version
29GNU bash, version 5.1.16(1)-release (x86_64-pc-linux-gnu)
30gcc version
31gcc (Ubuntu 11.4.0-1ubuntu1~22.04) 11.4.0
32docker version
33Client:
34 Version: 24.0.7
35 API version: 1.43
36 Go version: go1.21.1
37 Git commit: 24.0.7-0ubuntu2~22.04.1
38 Built: Wed Mar 13 20:23:54 2024
39 OS/Arch: linux/amd64
40 Context: default
42Server:
43 Engine:
44 Version: 24.0.7
45 API version: 1.43 (minimum version 1.12)
46 Go version: go1.21.1
47 Git commit: 24.0.7-0ubuntu2~22.04.1
48 Built: Wed Mar 13 20:23:54 2024
49 OS/Arch: linux/amd64
50 Experimental: false
51 containerd:
52 Version: 1.7.12
53 GitCommit:
54 runc:
55 Version: 1.1.12-0ubuntu2~22.04.1
56 GitCommit:
57 docker-init:
58 Version: 0.19.0
59 GitCommit:
60clang version
61clang version 18.1.8
62jq version
63jq-1.7.1
64bats version
65Bats 1.11.0
66shellcheck version
670.10.0
68shfmt version
69v3.8.0
70ccache version
714.5.1
72cmake version
73cmake version 3.29.0
74heroku version
75heroku/9.5.0 linux-x64 node-v16.20.2
76imagemagick version
77Version: ImageMagick 6.9.11-60 Q16 x86_64 2021-01-25 https://imagemagick.org
78md5deep version
794.4
80mercurial version
81version 6.5.2
82mysql version
83mysql Ver 8.0.40-0ubuntu0.22.04.1 for Linux on x86_64 ((Ubuntu))
84openssl version
85OpenSSL 3.0.2 15 Mar 2022 (Library: OpenSSL 3.0.2 15 Mar 2022)
86packer version
87Packer v1.11.2
88postgresql client version
89psql (PostgreSQL) 14.13 (Ubuntu 14.13-0ubuntu0.22.04.1)
90ragel version
91Ragel State Machine Compiler version 6.10 March 2017
92sudo version
931.9.9
94gzip version
95gzip 1.10
96zip version
97Zip 3.0
98vim version
99VIM - Vi IMproved 8.2 (2019 Dec 12, compiled Oct 16 2024 17:27:14)
100iptables version
101iptables v1.8.7 (nf_tables)
102curl version
103curl 7.81.0 (x86_64-pc-linux-gnu) libcurl/7.81.0 OpenSSL/3.0.2 zlib/1.2.11 brotli/1.0.9 zstd/1.4.8 libidn2/2.3.2 libpsl/0.21.0 (+libidn2/2.3.2) libssh/0.9.6/openssl/zlib nghttp2/1.43.0 librtmp/2.3 OpenLDAP/2.5.18
104wget version
105GNU Wget 1.21.2 built on linux-gnu.
106rsync version
107rsync version 3.2.7 protocol version 31
108nvm version
1090.40.1
110perlbrew version
111/home/travis/perl5/perlbrew/bin/perlbrew - App::perlbrew/0.95
112phpenv version
113rbenv 1.3.0
114rvm version
115rvm 1.29.12 (latest) by Michal Papis, Piotr Kuczynski, Wayne E. Seguin [https://rvm.io]
116default ruby version
117ruby 3.3.5 (2024-09-03 revision ef084cc8f4) [x86_64-linux]
118default python version
119Python 3.10.14
120ElasticSearch version
1217.16.3
122Installed Firefox version
123firefox 99.0
124MongoDB version
125MongoDB 6.0.19
126ant version
127Apache Ant(TM) version 1.10.12 compiled on January 17 1970
128mvn version
129Apache Maven 3.9.4 (dfbb324ad4a7c8fb0bf182e6d91b0ae20e3d2dd9)
130gradle version
131Gradle 8.3!
132lein version
133Leiningen 2.11.2 on Java 11.0.21 OpenJDK 64-Bit Server VM
134Pre-installed Node.js versions
135v10.24.1
136v12.22.12
137v14.21.3
138v16.15
139v16.20.2
140v18.20.3
141v18.20.5
142v20.18.1
143v22.11.0
144v4.9.1
145v6.17.1
146v8.17.0
147phpenv versions
148 system
149 8.1
150* 8.1.2 (set by /home/travis/.phpenv/version)
151 hhvm-stable
152 hhvm
153composer --version
154Composer version 2.3.7 2022-06-06 16:43:28
155Pre-installed Ruby versions
156ruby-2.7.8
157ruby-3.3.5
1590.02s0.00s0.52s0.24s0.05s0.00s0.03s0.00s0.03s0.01s0.03s0.01s0.01s0.00s0.43sOK
1600.00s0.05s0.00s0.01s0.13s0.00s0.00s0.00s0.01s0.00s0.12s0.00s0.91s0.00s0.00s19.80s0.00s3.23s0.00s3.66s
docker_mtu_and_registry_mirrors
Docker
resolvconf
161Downloading archive: https://storage.googleapis.com/travis-ci-language-archives/python/binaries/ubuntu/22.04/x86_64/python-3.13.tar.bz2
1620.68s$ curl -sSf --retry 5 -o python-3.13.tar.bz2 ${archive_url}
16317.29s$ sudo tar xjf python-3.13.tar.bz2 --directory /
1640.00s
ssh_known_hosts.0
165Adding ssh known hosts
166$ mkdir -p ${TRAVIS_HOME}/.ssh
1670.05s$ ssh-keyscan -t $TRAVIS_SSH_KEY_TYPES -H localhost 2>&1 | tee -a ${TRAVIS_HOME}/.ssh/known_hosts
168# localhost:22 SSH-2.0-OpenSSH_8.9p1 Ubuntu-3ubuntu0.10
169# localhost:22 SSH-2.0-OpenSSH_8.9p1 Ubuntu-3ubuntu0.10
170# localhost:22 SSH-2.0-OpenSSH_8.9p1 Ubuntu-3ubuntu0.10
171|1|FNLMyQL+X31DxXzLO/rh/uPXUQQ=|mbtehflkyxf6miBN9H1Uhk/fSjQ= ssh-rsa AAAAB3NzaC1yc2EAAAADAQABAAABgQC3HFI6rtIj/GuMEyW1RTjiBc7+J7Vpt8P4SH+v052iAYR3E2U2zZLGrmdvSRbQlmT/gV35L078opxGKb+NYDnZ6pgeb9/id4k5UEKKtLriarKEchv1BtOhmwy+7dFV0sGqGMfcrUQDpFweJUThsiRMAFN+CguOsLIZBz6n5TIXAloW/jewoOtylEfINfTJEODKvaPl7gYORLYUpzLGuldjvyxos+FILF+Hsb38rOu1YLjWiEVk25KzQ1BHocZwk2Yin50wQHcm3JfXb95xFRGvJdCZGwICNAfr66u9tAXzG3eYOhd178trKl16GZZeXOXP7y0Sgw9GQFToBF+ybybZHq3zj5r0KTqyKatnh3ejg7K702pQpITKL+FtmHNg9SYWhSK1awwrdoTrVTNvEYF73OOxzX0cUEM24DwgXZ9IjULbaEXCRPL+zxuDMILjid/qLyWUE9zDf21CAiFI2jgwF6Zf+OnhuzpG+lvI2pR4Q2Ks1vfxchvchgCruCtSvVU=
172|1|d/wmPO333FfdrJ6l7zyiJHkL9Ks=|i6dt2RYhV4i/0vpZAm7PDjbmAcE= ecdsa-sha2-nistp256 AAAAE2VjZHNhLXNoYTItbmlzdHAyNTYAAAAIbmlzdHAyNTYAAABBBMIe0gbM8XDsBJmBnij8+Cb/EpVgrtMJzR3JRv5h+tdVqFRtMiz5zud9VJwPN3Yke/gSetvEWasxJG2rHVLoupc=
git.checkout
1740.01s1.12s$ git clone --depth=50 https://github.com/bit-team/backintime.git bit-team/backintime
175Cloning into 'bit-team/backintime'...
176remote: Enumerating objects: 932, done.
177remote: Counting objects: 100% (932/932), done.
178remote: Compressing objects: 100% (559/559), done.
179remote: Total 932 (delta 541), reused 631 (delta 344), pack-reused 0 (from 0)
180Receiving objects: 100% (932/932), 4.82 MiB | 19.05 MiB/s, done.
181Resolving deltas: 100% (541/541), done.
182$ cd bit-team/backintime
1830.31s$ git fetch origin +refs/pull/2039/merge: --depth=50
184remote: Enumerating objects: 43, done.
185remote: Counting objects: 100% (38/38), done.
186remote: Compressing objects: 100% (17/17), done.
187remote: Total 29 (delta 22), reused 18 (delta 12), pack-reused 0 (from 0)
188Unpacking objects: 100% (29/29), 4.63 KiB | 365.00 KiB/s, done.
189From https://github.com/bit-team/backintime
190 * branch refs/pull/2039/merge -> FETCH_HEAD
191$ git checkout -qf FETCH_HEAD
1930.00s
194Setting environment variables from .travis.yml
195$ export PYTHONUNBUFFERED=1
1970.00s$ source ~/virtualenv/python3.13/bin/activate
198$ python --version
199Python 3.13.1
200$ pip --version
201pip 25.0 from /home/travis/virtualenv/python3.13.1/lib/python3.13/site-packages/pip (python 3.13)
before_install.1
2020.01s$ sudo rm -f /etc/apt/sources.list.d/mongodb*.list
before_install.2
2030.10s$ sudo apt-key del 90CFB1F5
204Warning: apt-key is deprecated. Manage keyring files in trusted.gpg.d instead (see apt-key(8)).
205OK
before_install.3
2062.27s$ sudo apt-get -qq update
207W: http://package.perforce.com/apt/ubuntu/dists/jammy/InRelease: Key is stored in legacy trusted.gpg keyring (/etc/apt/trusted.gpg), see the DEPRECATION section in apt-key(8) for details.
208W: http://apt.postgresql.org/pub/repos/apt/dists/jammy-pgdg/InRelease: Key is stored in legacy trusted.gpg keyring (/etc/apt/trusted.gpg), see the DEPRECATION section in apt-key(8) for details.
before_install.4
2095.49s$ sudo apt-get install -y sshfs screen util-linux libdbus-1-dev
210Reading package lists... Done
211Building dependency tree... Done
212Reading state information... Done
213screen is already the newest version (4.9.0-1).
214libdbus-1-dev is already the newest version (1.12.20-2ubuntu4.1).
215util-linux is already the newest version (2.37.2-4ubuntu3.4).
216The following NEW packages will be installed:
217 sshfs
2180 upgraded, 1 newly installed, 0 to remove and 134 not upgraded.
219Need to get 45.1 kB of archives.
220After this operation, 126 kB of additional disk space will be used.
221Get:1 http://archive.ubuntu.com/ubuntu jammy/universe amd64 sshfs amd64 3.7.1+repack-2 [45.1 kB]
222Fetched 45.1 kB in 0s (364 kB/s)
223Selecting previously unselected package sshfs.
224(Reading database ... 132481 files and directories currently installed.)
225Preparing to unpack .../sshfs_3.7.1+repack-2_amd64.deb ...
226Unpacking sshfs (3.7.1+repack-2) ...
227Setting up sshfs (3.7.1+repack-2) ...
228Processing triggers for man-db (2.10.2-1) ...
229NEEDRESTART-VER: 3.5
230NEEDRESTART-KCUR: 6.8.0-1018-gcp
231NEEDRESTART-KEXP: 6.8.0-1018-gcp
232NEEDRESTART-KSTA: 1
install.1
2331.84s$ pip install -U pip
234Requirement already satisfied: pip in /home/travis/virtualenv/python3.13.1/lib/python3.13/site-packages (25.0)
235Collecting pip
236 Downloading pip-25.0.1-py3-none-any.whl.metadata (3.7 kB)
237Downloading pip-25.0.1-py3-none-any.whl (1.8 MB)
238Installing collected packages: pip
239 Attempting uninstall: pip
240 Found existing installation: pip 25.0
241 Uninstalling pip-25.0:
242 Successfully uninstalled pip-25.0
243Successfully installed pip-25.0.1
install.2
2446.78s$ pip install pylint ruff flake8 pyfakefs keyring
245Collecting pylint
246 Downloading pylint-3.3.4-py3-none-any.whl.metadata (12 kB)
247Collecting ruff
248 Downloading ruff-0.9.6-py3-none-manylinux_2_17_x86_64.manylinux2014_x86_64.whl.metadata (25 kB)
249Collecting flake8
250 Downloading flake8-7.1.2-py2.py3-none-any.whl.metadata (3.8 kB)
251Collecting pyfakefs
252 Downloading pyfakefs-5.7.4-py3-none-any.whl.metadata (7.8 kB)
253Collecting keyring
254 Downloading keyring-25.6.0-py3-none-any.whl.metadata (20 kB)
255Collecting dill>=0.3.6 (from pylint)
256 Downloading dill-0.3.9-py3-none-any.whl.metadata (10 kB)
257Requirement already satisfied: platformdirs>=2.2.0 in /home/travis/virtualenv/python3.13.1/lib/python3.13/site-packages (from pylint) (4.3.6)
258Collecting astroid<=3.4.0-dev0,>=3.3.8 (from pylint)
259 Downloading astroid-3.3.8-py3-none-any.whl.metadata (4.5 kB)
260Collecting isort!=5.13.0,<7,>=4.2.5 (from pylint)
261 Downloading isort-6.0.0-py3-none-any.whl.metadata (11 kB)
262Collecting mccabe<0.8,>=0.6 (from pylint)
263 Downloading mccabe-0.7.0-py2.py3-none-any.whl.metadata (5.0 kB)
264Collecting tomlkit>=0.10.1 (from pylint)
265 Downloading tomlkit-0.13.2-py3-none-any.whl.metadata (2.7 kB)
266Collecting pycodestyle<2.13.0,>=2.12.0 (from flake8)
267 Downloading pycodestyle-2.12.1-py2.py3-none-any.whl.metadata (4.5 kB)
268Collecting pyflakes<3.3.0,>=3.2.0 (from flake8)
269 Downloading pyflakes-3.2.0-py2.py3-none-any.whl.metadata (3.5 kB)
270Collecting SecretStorage>=3.2 (from keyring)
271 Downloading SecretStorage-3.3.3-py3-none-any.whl.metadata (4.0 kB)
272Collecting jeepney>=0.4.2 (from keyring)
273 Downloading jeepney-0.8.0-py3-none-any.whl.metadata (1.3 kB)
274Collecting jaraco.classes (from keyring)
275 Downloading jaraco.classes-3.4.0-py3-none-any.whl.metadata (2.6 kB)
276Collecting jaraco.functools (from keyring)
277 Downloading jaraco.functools-4.1.0-py3-none-any.whl.metadata (2.9 kB)
278Collecting jaraco.context (from keyring)
279 Downloading jaraco.context-6.0.1-py3-none-any.whl.metadata (4.1 kB)
280Collecting cryptography>=2.0 (from SecretStorage>=3.2->keyring)
281 Downloading cryptography-44.0.1-cp39-abi3-manylinux_2_34_x86_64.whl.metadata (5.7 kB)
282Collecting more-itertools (from jaraco.classes->keyring)
283 Downloading more_itertools-10.6.0-py3-none-any.whl.metadata (37 kB)
284Collecting cffi>=1.12 (from cryptography>=2.0->SecretStorage>=3.2->keyring)
285 Downloading cffi-1.17.1-cp313-cp313-manylinux_2_17_x86_64.manylinux2014_x86_64.whl.metadata (1.5 kB)
286Collecting pycparser (from cffi>=1.12->cryptography>=2.0->SecretStorage>=3.2->keyring)
287 Downloading pycparser-2.22-py3-none-any.whl.metadata (943 bytes)
288Downloading pylint-3.3.4-py3-none-any.whl (522 kB)
289Downloading ruff-0.9.6-py3-none-manylinux_2_17_x86_64.manylinux2014_x86_64.whl (12.5 MB)
290Downloading flake8-7.1.2-py2.py3-none-any.whl (57 kB)
291Downloading pyfakefs-5.7.4-py3-none-any.whl (228 kB)
292Downloading keyring-25.6.0-py3-none-any.whl (39 kB)
293Downloading astroid-3.3.8-py3-none-any.whl (275 kB)
294Downloading dill-0.3.9-py3-none-any.whl (119 kB)
295Downloading isort-6.0.0-py3-none-any.whl (94 kB)
296Downloading jeepney-0.8.0-py3-none-any.whl (48 kB)
297Downloading mccabe-0.7.0-py2.py3-none-any.whl (7.3 kB)
298Downloading pycodestyle-2.12.1-py2.py3-none-any.whl (31 kB)
299Downloading pyflakes-3.2.0-py2.py3-none-any.whl (62 kB)
300Downloading SecretStorage-3.3.3-py3-none-any.whl (15 kB)
301Downloading tomlkit-0.13.2-py3-none-any.whl (37 kB)
302Downloading jaraco.classes-3.4.0-py3-none-any.whl (6.8 kB)
303Downloading jaraco.context-6.0.1-py3-none-any.whl (6.8 kB)
304Downloading jaraco.functools-4.1.0-py3-none-any.whl (10 kB)
305Downloading cryptography-44.0.1-cp39-abi3-manylinux_2_34_x86_64.whl (4.2 MB)
306Downloading more_itertools-10.6.0-py3-none-any.whl (63 kB)
307Downloading cffi-1.17.1-cp313-cp313-manylinux_2_17_x86_64.manylinux2014_x86_64.whl (479 kB)
308Downloading pycparser-2.22-py3-none-any.whl (117 kB)
309Installing collected packages: tomlkit, ruff, pyflakes, pyfakefs, pycparser, pycodestyle, more-itertools, mccabe, jeepney, jaraco.context, isort, dill, astroid, pylint, jaraco.functools, jaraco.classes, flake8, cffi, cryptography, SecretStorage, keyring
310Successfully installed SecretStorage-3.3.3 astroid-3.3.8 cffi-1.17.1 cryptography-44.0.1 dill-0.3.9 flake8-7.1.2 isort-6.0.0 jaraco.classes-3.4.0 jaraco.context-6.0.1 jaraco.functools-4.1.0 jeepney-0.8.0 keyring-25.6.0 mccabe-0.7.0 more-itertools-10.6.0 pycodestyle-2.12.1 pycparser-2.22 pyfakefs-5.7.4 pyflakes-3.2.0 pylint-3.3.4 ruff-0.9.6 tomlkit-0.13.2
install.3
31114.32s$ pip install pyqt6 dbus-python
312Collecting pyqt6
313 Downloading PyQt6-6.8.1-cp39-abi3-manylinux_2_28_x86_64.whl.metadata (2.1 kB)
314Collecting dbus-python
315 Downloading dbus-python-1.3.2.tar.gz (605 kB)
316 Installing build dependencies ... done
317 Getting requirements to build wheel ... done
318 Preparing metadata (pyproject.toml) ... done
319Collecting PyQt6-sip<14,>=13.8 (from pyqt6)
320 Downloading PyQt6_sip-13.10.0-cp313-cp313-manylinux_2_5_x86_64.manylinux1_x86_64.whl.metadata (472 bytes)
321Collecting PyQt6-Qt6<6.9.0,>=6.8.0 (from pyqt6)
322 Downloading PyQt6_Qt6-6.8.2-py3-none-manylinux_2_28_x86_64.whl.metadata (534 bytes)
323Downloading PyQt6-6.8.1-cp39-abi3-manylinux_2_28_x86_64.whl (8.2 MB)
324Downloading PyQt6_Qt6-6.8.2-py3-none-manylinux_2_28_x86_64.whl (81.3 MB)
325Downloading PyQt6_sip-13.10.0-cp313-cp313-manylinux_2_5_x86_64.manylinux1_x86_64.whl (303 kB)
326Building wheels for collected packages: dbus-python
327 Building wheel for dbus-python (pyproject.toml) ... done
328 Created wheel for dbus-python: filename=dbus_python-1.3.2-cp313-cp313-linux_x86_64.whl size=122684 sha256=8f2e208c3c3af3047a958f5ec0a046bb88ddc42d26eb5f66f43bfc4ccfc32083
329 Stored in directory: /home/travis/.cache/pip/wheels/5d/23/1a/9e68bd3918c8f34a7ab75dda40f5c012553a32ca87408ce35f
330Successfully built dbus-python
331Installing collected packages: PyQt6-Qt6, PyQt6-sip, dbus-python, pyqt6
332Successfully installed PyQt6-Qt6-6.8.2 PyQt6-sip-13.10.0 dbus-python-1.3.2 pyqt6-6.8.1
install.4
3330.26s$ ssh-keygen -b 2048 -t rsa -f /home/travis/.ssh/id_rsa -N ""
334Generating public/private rsa key pair.
335Your identification has been saved in /home/travis/.ssh/id_rsa
336Your public key has been saved in /home/travis/.ssh/id_rsa.pub
337The key fingerprint is:
338SHA256:Rmb1tfqj4pijC0j/OPJR+cUqkiWGyL1I2LYmHO7oFYM travis@travis-job-83968406-33df-4e4d-becf-0138d9654188
339The key's randomart image is:
340+---[RSA 2048]----+
341| . . |
342| . . . . |
343| + . . |
344|ooo. = . . |
345|oE=+o + S o . |
346|+oo=+= o o . |
347|.++o* . o o |
348|ooo .* ..o. . . |
349|oo oo.+ooo... |
350+----[SHA256]-----+
install.5
3510.00s$ cat ~/.ssh/id_rsa.pub >> ~/.ssh/authorized_keys
install.6
3520.01s$ eval `ssh-agent -s`
353Agent pid 5160
3540.28s$ python -m compileall common common/test common/plugins qt qt/test qt/plugins
355Listing 'common'...
356Compiling 'common/applicationinstance.py'...
357Compiling 'common/askpass.py'...
358Compiling 'common/backintime.py'...
359Listing 'common/bash-completion'...
360Compiling 'common/bcolors.py'...
361Compiling 'common/bitbase.py'...
362Compiling 'common/cli.py'...
363Compiling 'common/config.py'...
364Compiling 'common/configfile.py'...
365Compiling 'common/daemon.py'...
366Compiling 'common/diagnostics.py'...
367Listing 'common/doc-dev'...
368Listing 'common/doc-dev/_static'...
369Listing 'common/doc-dev/_templates'...
370Compiling 'common/doc-dev/conf.py'...
371Listing 'common/doc-dev/plugins'...
372Compiling 'common/encfstools.py'...
373Compiling 'common/encode.py'...
374Compiling 'common/exceptions.py'...
375Compiling 'common/flock.py'...
376Compiling 'common/guiapplicationinstance.py'...
377Compiling 'common/languages.py'...
378Compiling 'common/logger.py'...
379Listing 'common/man'...
380Listing 'common/man/C'...
381Compiling 'common/mount.py'...
382Compiling 'common/password.py'...
383Compiling 'common/password_ipc.py'...
384Compiling 'common/pluginmanager.py'...
385Listing 'common/plugins'...
386Compiling 'common/plugins/usercallbackplugin.py'...
387Listing 'common/po'...
388Compiling 'common/progress.py'...
389Compiling 'common/qt_probing.py'...
390Compiling 'common/schedule.py'...
391Compiling 'common/singleton.py'...
392Compiling 'common/snapshotlog.py'...
393Compiling 'common/snapshots.py'...
394Compiling 'common/ssh_max_arg.py'...
395Compiling 'common/sshtools.py'...
396Listing 'common/test'...
397Compiling 'common/test/__init__.py'...
398Compiling 'common/test/constants.py'...
399Compiling 'common/test/generic.py'...
400Compiling 'common/test/test_applicationinstance.py'...
401Compiling 'common/test/test_argparser.py'...
402Compiling 'common/test/test_backintime.py'...
403Compiling 'common/test/test_backup.py'...
404Compiling 'common/test/test_config.py'...
405Compiling 'common/test/test_config_crontab.py'...
406Compiling 'common/test/test_configfile.py'...
407Compiling 'common/test/test_diagnostics.py'...
408Compiling 'common/test/test_encfstools.py'...
409Compiling 'common/test/test_languages.py'...
410Compiling 'common/test/test_lint.py'...
411Compiling 'common/test/test_mount.py'...
412Compiling 'common/test/test_plugin_usercallback.py'...
413Compiling 'common/test/test_restore.py'...
414Compiling 'common/test/test_schedule.py'...
415Compiling 'common/test/test_sid.py'...
416Compiling 'common/test/test_singleton.py'...
417Compiling 'common/test/test_snapshotlog.py'...
418Compiling 'common/test/test_snapshots.py'...
419Compiling 'common/test/test_snapshots_autoremove.py'...
420Compiling 'common/test/test_sshtools.py'...
421Compiling 'common/test/test_takeSnapshot.py'...
422Compiling 'common/test/test_tools.py'...
423Compiling 'common/test/test_uniquenessset.py'...
424Compiling 'common/tools.py'...
425Compiling 'common/uniquenessset.py'...
426Compiling 'common/version.py'...
427Listing 'common/test'...
428Listing 'common/plugins'...
429Listing 'qt'...
430Compiling 'qt/aboutdlg.py'...
431Compiling 'qt/app.py'...
432Compiling 'qt/editusercallback.py'...
433Compiling 'qt/encfsmsgbox.py'...
434Compiling 'qt/icon.py'...
435Listing 'qt/icons'...
436Listing 'qt/icons/16x16'...
437Listing 'qt/icons/16x16/actions'...
438Listing 'qt/icons/22x22'...
439Listing 'qt/icons/22x22/actions'...
440Listing 'qt/icons/24x24'...
441Listing 'qt/icons/24x24/actions'...
442Listing 'qt/icons/32x32'...
443Listing 'qt/icons/32x32/actions'...
444Listing 'qt/icons/48x48'...
445Listing 'qt/icons/48x48/actions'...
446Listing 'qt/icons/scalable'...
447Listing 'qt/icons/scalable/actions'...
448Compiling 'qt/languagedialog.py'...
449Compiling 'qt/logviewdialog.py'...
450Listing 'qt/man'...
451Listing 'qt/man/C'...
452Listing 'qt/manageprofiles'...
453Compiling 'qt/manageprofiles/__init__.py'...
454Compiling 'qt/manageprofiles/combobox.py'...
455Compiling 'qt/manageprofiles/schedulewidget.py'...
456Compiling 'qt/manageprofiles/spinboxunit.py'...
457Compiling 'qt/manageprofiles/sshproxywidget.py'...
458Compiling 'qt/manageprofiles/statebindcheckbox.py'...
459Compiling 'qt/manageprofiles/tab_expert_options.py'...
460Compiling 'qt/manageprofiles/tab_general.py'...
461Compiling 'qt/manageprofiles/tab_options.py'...
462Compiling 'qt/manageprofiles/tab_remove_retention.py'...
463Compiling 'qt/messagebox.py'...
464Listing 'qt/plugins'...
465Compiling 'qt/plugins/notifyplugin.py'...
466Compiling 'qt/plugins/systrayiconplugin.py'...
467Compiling 'qt/qtsystrayicon.py'...
468Compiling 'qt/qttools.py'...
469Compiling 'qt/qttools_path.py'...
470Compiling 'qt/restoreconfigdialog.py'...
471Compiling 'qt/restoredialog.py'...
472Compiling 'qt/serviceHelper.py'...
473Compiling 'qt/snapshotsdialog.py'...
474Compiling 'qt/statedata.py'...
475Listing 'qt/test'...
476Compiling 'qt/test/__init__.py'...
477Compiling 'qt/test/test_lint.py'...
478Compiling 'qt/test/test_statedata.py'...
479Compiling 'qt/usermessagedialog.py'...
480Listing 'qt/test'...
481Listing 'qt/plugins'...
482The command "python -m compileall common common/test common/plugins qt qt/test qt/plugins" exited with 0.
4830.00s$ cd common
484The command "cd common" exited with 0.
4850.12s$ ./configure
486Replacement of python path with "/usr/bin/python3" successful.
487All OK. Now run:
488 make
489 sudo make install
490The command "./configure" exited with 0.
49164.15s$ make unittest-v
492/home/travis/virtualenv/python3.13.1/bin/pytest -v
493============================= test session starts ==============================
494platform linux -- Python 3.13.1, pytest-8.3.4, pluggy-1.5.0 -- /home/travis/virtualenv/python3.13.1/bin/python
495cachedir: .pytest_cache
496rootdir: /home/travis/build/bit-team/backintime/common
497plugins: pyfakefs-5.7.4
498collected 426 items
500test/test_applicationinstance.py::General::test_autoExit_other_running_process PASSED [ 0%]
501test/test_applicationinstance.py::General::test_autoExit_unique_process PASSED [ 0%]
502test/test_applicationinstance.py::General::test_auto_flock PASSED [ 0%]
503test/test_applicationinstance.py::General::test_create_and_remove_pid_file PASSED [ 0%]
504test/test_applicationinstance.py::General::test_existing_process_with_correct_proc_cmdline PASSED [ 1%]
505test/test_applicationinstance.py::General::test_existing_process_with_correct_procname PASSED [ 1%]
506test/test_applicationinstance.py::General::test_existing_process_with_wrong_pid PASSED [ 1%]
507test/test_applicationinstance.py::General::test_existing_process_with_wrong_procname PASSED [ 1%]
508test/test_applicationinstance.py::General::test_flock_exclusive PASSED [ 2%]
509test/test_applicationinstance.py::General::test_flock_exclusive_fail PASSED [ 2%]
510test/test_applicationinstance.py::General::test_killing_existing_process PASSED [ 2%]
511test/test_applicationinstance.py::General::test_leftover_empty_lockfile PASSED [ 2%]
512test/test_applicationinstance.py::General::test_no_pid_file PASSED [ 3%]
513test/test_applicationinstance.py::General::test_non_existing_process PASSED [ 3%]
514test/test_applicationinstance.py::General::test_pid_file_content PASSED [ 3%]
515test/test_applicationinstance.py::General::test_readPidFile PASSED [ 3%]
516test/test_applicationinstance.py::General::test_readPidFile_fail PASSED [ 3%]
517test/test_applicationinstance.py::General::test_thread_write_without_flock PASSED [ 4%]
518test/test_applicationinstance.py::General::test_write_pid_fail PASSED [ 4%]
519test/test_argparser.py::General::test_config PASSED [ 4%]
520test/test_argparser.py::General::test_config_no_path PASSED [ 4%]
521test/test_argparser.py::General::test_debug PASSED [ 5%]
522test/test_argparser.py::General::test_invalid_arg PASSED [ 5%]
523test/test_argparser.py::General::test_quiet PASSED [ 5%]
524test/test_argparser.py::Backup::test_backwards_compatiblity_alias PASSED [ 5%]
525test/test_argparser.py::Backup::test_multi_args PASSED [ 6%]
526test/test_argparser.py::Backup::test_profile PASSED [ 6%]
527test/test_argparser.py::Backup::test_profile_and_profile_id PASSED [ 6%]
528test/test_argparser.py::Backup::test_profile_id PASSED [ 6%]
529test/test_argparser.py::Backup::test_quiet PASSED [ 7%]
530test/test_argparser.py::Backup::test_simple PASSED [ 7%]
531test/test_argparser.py::Restore::test_empty_where PASSED [ 7%]
532test/test_argparser.py::Restore::test_local_backup_and_no_local_backup PASSED [ 7%]
533test/test_argparser.py::Restore::test_multi_args PASSED [ 7%]
534test/test_argparser.py::Restore::test_simple PASSED [ 8%]
535test/test_argparser.py::Restore::test_snapshot_id_index PASSED [ 8%]
536test/test_argparser.py::Restore::test_what_space_in_path PASSED [ 8%]
537test/test_argparser.py::Restore::test_what_where_snapshot_id PASSED [ 8%]
538test/test_argparser.py::Restore::test_what_where_snapshot_id_multi_args PASSED [ 9%]
539test/test_argparser.py::Restore::test_where_space_in_path PASSED [ 9%]
540test/test_backintime.py::BackInTime::test_diagnostics_arg PASSED [ 9%]
541test/test_backintime.py::BackInTime::test_local_snapshot_is_successful PASSED [ 9%]
542test/test_backintime.py::BackInTime::test_quiet_mode PASSED [ 10%]
543test/test_backup.py::TestBackup::test_already_running PASSED [ 10%]
544test/test_backup.py::TestBackup::test_backup PASSED [ 10%]
545test/test_backup.py::TestBackup::test_backup_async PASSED [ 10%]
546test/test_backup.py::TestBackup::test_backup_async_profile_2 PASSED [ 11%]
547test/test_backup.py::TestBackup::test_backup_async_with_checksum PASSED [ 11%]
548test/test_backup.py::TestBackup::test_cant_backup PASSED [ 11%]
549test/test_backup.py::TestBackup::test_mount_exception PASSED [ 11%]
550test/test_backup.py::TestBackup::test_no_backup_on_battery PASSED [ 11%]
551test/test_backup.py::TestBackup::test_no_changes PASSED [ 12%]
552test/test_backup.py::TestBackup::test_not_configured PASSED [ 12%]
553test/test_backup.py::TestBackup::test_plugin_prevented_backup PASSED [ 12%]
554test/test_backup.py::TestBackup::test_scheduled PASSED [ 12%]
555test/test_backup.py::TestBackup::test_takeSnapshot_exception_cleanup PASSED [ 13%]
556test/test_backup.py::TestBackup::test_umount_exception PASSED [ 13%]
557test/test_backup.py::TestBackup::test_with_errors PASSED [ 13%]
558test/test_config.py::RemoveOldSnapshotsDate::test_day PASSED [ 13%]
559test/test_config.py::RemoveOldSnapshotsDate::test_invalid_unit PASSED [ 14%]
560test/test_config.py::RemoveOldSnapshotsDate::test_week_always_monday PASSED [ 14%]
561test/test_config.py::RemoveOldSnapshotsDate::test_week_ignore_current PASSED [ 14%]
562test/test_config.py::RemoveOldSnapshotsDate::test_year_ignore_current_month PASSED [ 14%]
563test/test_config.py::SshCommand::test_cipher_aes256_cbc PASSED [ 15%]
564test/test_config.py::SshCommand::test_cipher_disabled PASSED [ 15%]
565test/test_config.py::SshCommand::test_custom_args PASSED [ 15%]
566test/test_config.py::SshCommand::test_disable_args PASSED [ 15%]
567test/test_config.py::SshCommand::test_full_command PASSED [ 15%]
568test/test_config.py::SshCommand::test_nice_and_ionice PASSED [ 16%]
569test/test_config.py::SshCommand::test_nice_and_ionice_without_command PASSED [ 16%]
570test/test_config.py::SshCommand::test_prefix PASSED [ 16%]
571test/test_config.py::SshCommand::test_prefix_false PASSED [ 16%]
572test/test_config.py::SshCommand::test_quote PASSED [ 17%]
573test/test_config.py::SshCommand::test_quote_without_command PASSED [ 17%]
574test/test_config.py::SshCommand::test_without_command PASSED [ 17%]
575test/test_config_crontab.py::Cron::test_cron_lines PASSED [ 17%]
576test/test_config_crontab.py::CrontabDebug::test_crontab_contains_debug PASSED [ 18%]
577test/test_config_crontab.py::CrontabDebug::test_crontab_without_debug PASSED [ 18%]
578test/test_configfile.py::TestConfigFile::test_boolValue PASSED [ 18%]
579test/test_configfile.py::TestConfigFile::test_boolValue_default PASSED [ 18%]
580test/test_configfile.py::TestConfigFile::test_hasKey PASSED [ 19%]
581test/test_configfile.py::TestConfigFile::test_intValue PASSED [ 19%]
582test/test_configfile.py::TestConfigFile::test_intValue_default PASSED [ 19%]
583test/test_configfile.py::TestConfigFile::test_listValue_bool PASSED [ 19%]
584test/test_configfile.py::TestConfigFile::test_listValue_default PASSED [ 19%]
585test/test_configfile.py::TestConfigFile::test_listValue_empty_list PASSED [ 20%]
586test/test_configfile.py::TestConfigFile::test_listValue_int PASSED [ 20%]
587test/test_configfile.py::TestConfigFile::test_listValue_invalid_type PASSED [ 20%]
588test/test_configfile.py::TestConfigFile::test_listValue_missing_values PASSED [ 20%]
589test/test_configfile.py::TestConfigFile::test_listValue_str PASSED [ 21%]
590test/test_configfile.py::TestConfigFile::test_listValue_tuple PASSED [ 21%]
591test/test_configfile.py::TestConfigFile::test_listValue_tuple_missing_values PASSED [ 21%]
592test/test_configfile.py::TestConfigFile::test_listValue_wrong_size PASSED [ 21%]
593test/test_configfile.py::TestConfigFile::test_listValue_zero_count PASSED [ 22%]
594test/test_configfile.py::TestConfigFile::test_load PASSED [ 22%]
595test/test_configfile.py::TestConfigFile::test_remapKey PASSED [ 22%]
596test/test_configfile.py::TestConfigFile::test_remapKeyRegex PASSED [ 22%]
597test/test_configfile.py::TestConfigFile::test_remove_key PASSED [ 23%]
598test/test_configfile.py::TestConfigFile::test_remove_keys_start_with PASSED [ 23%]
599test/test_configfile.py::TestConfigFile::test_remove_keys_start_with_not_matching_prefix PASSED [ 23%]
600test/test_configfile.py::TestConfigFile::test_save PASSED [ 23%]
601test/test_configfile.py::TestConfigFile::test_setBoolValue PASSED [ 23%]
602test/test_configfile.py::TestConfigFile::test_setIntValue PASSED [ 24%]
603test/test_configfile.py::TestConfigFile::test_setListValue_bool PASSED [ 24%]
604test/test_configfile.py::TestConfigFile::test_setListValue_int PASSED [ 24%]
605test/test_configfile.py::TestConfigFile::test_setListValue_invalid_type_for_type_key PASSED [ 24%]
606test/test_configfile.py::TestConfigFile::test_setListValue_invalid_type_for_value PASSED [ 25%]
607test/test_configfile.py::TestConfigFile::test_setListValue_remove_leftovers PASSED [ 25%]
608test/test_configfile.py::TestConfigFile::test_setListValue_remove_leftovers_tuple PASSED [ 25%]
609test/test_configfile.py::TestConfigFile::test_setListValue_str PASSED [ 25%]
610test/test_configfile.py::TestConfigFile::test_setListValue_tuple PASSED [ 26%]
611test/test_configfile.py::TestConfigFile::test_setListValue_tuple_missing_values PASSED [ 26%]
612test/test_configfile.py::TestConfigFile::test_setStrValue PASSED [ 26%]
613test/test_configfile.py::TestConfigFile::test_strValue PASSED [ 26%]
614test/test_configfile.py::TestConfigFile::test_strValue_default PASSED [ 26%]
615test/test_configfile.py::TestConfigFileWithProfiles::test_addProfile PASSED [ 27%]
616test/test_configfile.py::TestConfigFileWithProfiles::test_current_profile PASSED [ 27%]
617test/test_configfile.py::TestConfigFileWithProfiles::test_current_profile_by_name PASSED [ 27%]
618test/test_configfile.py::TestConfigFileWithProfiles::test_get_profile_key PASSED [ 27%]
619test/test_configfile.py::TestConfigFileWithProfiles::test_hasProfileKey PASSED [ 28%]
620test/test_configfile.py::TestConfigFileWithProfiles::test_load PASSED [ 28%]
621test/test_configfile.py::TestConfigFileWithProfiles::test_profileExists PASSED [ 28%]
622test/test_configfile.py::TestConfigFileWithProfiles::test_profileExistsByName PASSED [ 28%]
623test/test_configfile.py::TestConfigFileWithProfiles::test_profileName PASSED [ 29%]
624test/test_configfile.py::TestConfigFileWithProfiles::test_profiles PASSED [ 29%]
625test/test_configfile.py::TestConfigFileWithProfiles::test_profilesSortedByName PASSED [ 29%]
626test/test_configfile.py::TestConfigFileWithProfiles::test_remapProfileKey PASSED [ 29%]
627test/test_configfile.py::TestConfigFileWithProfiles::test_removeProfile PASSED [ 30%]
628test/test_configfile.py::TestConfigFileWithProfiles::test_removeProfileKey PASSED [ 30%]
629test/test_configfile.py::TestConfigFileWithProfiles::test_removeProfileKeysStartsWith PASSED [ 30%]
630test/test_configfile.py::TestConfigFileWithProfiles::test_setProfileName PASSED [ 30%]
631test/test_configfile.py::TestConfigFileWithProfiles::test_set_profile_value PASSED [ 30%]
632test/test_diagnostics.py::Diagnostics::test_content_minimal PASSED [ 31%]
633test/test_diagnostics.py::Diagnostics::test_no_extern_version PASSED [ 31%]
634test/test_diagnostics.py::Diagnostics::test_no_ressource_warning PASSED [ 31%]
635test/test_diagnostics.py::Diagnostics::test_replace_user_path PASSED [ 31%]
636test/test_diagnostics.py::Diagnostics::test_some_content PASSED [ 32%]
637test/test_encfstools.py::TestEncFS_mount::test_dummy PASSED [ 32%]
638test/test_languages.py::General::test_completeness_key_types PASSED [ 32%]
639test/test_languages.py::General::test_completeness_value_types PASSED [ 32%]
640test/test_lint.py::MirrorMirrorOnTheWall::test005_ensure_linter_versions PASSED [ 33%]
641test/test_lint.py::MirrorMirrorOnTheWall::test010_ruff_default_ruleset PASSED [ 33%]
642test/test_lint.py::MirrorMirrorOnTheWall::test020_flake8_default_ruleset FAILED [ 33%]
643test/test_lint.py::MirrorMirrorOnTheWall::test030_pylint_default_ruleset PASSED [ 33%]
644test/test_lint.py::MirrorMirrorOnTheWall::test050_pylint_exclusive_ruleset PASSED [ 34%]
645test/test_lint.py::MirrorMirrorOnTheWall::test060_reuse SKIPPED (Usi...) [ 34%]
646test/test_mount.py::CheckLocks::test_foreign_lock PASSED [ 34%]
647test/test_mount.py::CheckLocks::test_foreign_lock_notexisting_pid PASSED [ 34%]
648test/test_mount.py::CheckLocks::test_ignore_own_lock PASSED [ 34%]
649test/test_mount.py::CheckLocks::test_lock_remove PASSED [ 35%]
650test/test_mount.py::CheckLocks::test_not_existing_dir PASSED [ 35%]
651test/test_mount.py::CheckLocks::test_own_lock_but_diff_tmpmount PASSED [ 35%]
652test/test_mount.py::CheckLocks::test_symlinks_remove PASSED [ 35%]
653test/test_mount.py::CheckHighLevelLocalMount::test_first_pre_mount_check PASSED [ 36%]
654test/test_mount.py::CheckHighLevelLocalMount::test_initialised_pre_mount_check PASSED [ 36%]
655test/test_mount.py::CheckHighLevelLocalMount::test_mount PASSED [ 36%]
656test/test_mount.py::CheckHighLevelLocalMount::test_remount_to_new_local_mount PASSED [ 36%]
657test/test_mount.py::CheckHighLevelLocalMount::test_umount PASSED [ 37%]
658test/test_plugin_usercallback.py::UserCallback::test_reason_appExit PASSED [ 37%]
659test/test_plugin_usercallback.py::UserCallback::test_reason_appStart PASSED [ 37%]
660test/test_plugin_usercallback.py::UserCallback::test_reason_error PASSED [ 37%]
661test/test_plugin_usercallback.py::UserCallback::test_reason_mount PASSED [ 38%]
662test/test_plugin_usercallback.py::UserCallback::test_reason_processBegin PASSED [ 38%]
663test/test_plugin_usercallback.py::UserCallback::test_reason_processEnd PASSED [ 38%]
664test/test_plugin_usercallback.py::UserCallback::test_reason_processnewSnapshot PASSED [ 38%]
665test/test_plugin_usercallback.py::UserCallback::test_reason_unmount PASSED [ 38%]
666test/test_plugin_usercallback.py::SystemTest::test_local_snapshot PASSED [ 39%]
667test/test_restore.py::TestRestore::test_backup PASSED [ 39%]
668test/test_restore.py::TestRestore::test_delete PASSED [ 39%]
669test/test_restore.py::TestRestore::test_no_backup PASSED [ 39%]
670test/test_restore.py::TestRestore::test_only_new PASSED [ 40%]
671test/test_restore.py::TestRestore::test_restore_folder_to_different_destination PASSED [ 40%]
672test/test_restore.py::TestRestore::test_restore_multiple_files PASSED [ 40%]
673test/test_restore.py::TestRestore::test_restore_to_different_destination PASSED [ 40%]
674test/test_restore.py::TestRestoreLocal::test_restore PASSED [ 41%]
675test/test_restore.py::TestRestoreLocal::test_restore_file_with_spaces PASSED [ 41%]
676test/test_restore.py::TestRestoreSSH::test_restore PASSED [ 41%]
677test/test_restore.py::TestRestoreSSH::test_restore_file_with_spaces PASSED [ 41%]
678test/test_schedule.py::Schedule::test_bit_to_crontab PASSED [ 42%]
679test/test_schedule.py::Schedule::test_remove_bit_entries PASSED [ 42%]
680test/test_sid.py::TestSID::test_displayID PASSED [ 42%]
681test/test_sid.py::TestSID::test_displayName PASSED [ 42%]
682test/test_sid.py::TestSID::test_equal_sid PASSED [ 42%]
683test/test_sid.py::TestSID::test_exists PASSED [ 43%]
684test/test_sid.py::TestSID::test_failed PASSED [ 43%]
685test/test_sid.py::TestSID::test_fileInfo PASSED [ 43%]
686test/test_sid.py::TestSID::test_fileInfoErrorRead PASSED [ 43%]
687test/test_sid.py::TestSID::test_fileInfoErrorWrite PASSED [ 44%]
688test/test_sid.py::TestSID::test_hash PASSED [ 44%]
689test/test_sid.py::TestSID::test_info PASSED [ 44%]
690test/test_sid.py::TestSID::test_isExistingPathInsideSnapshotFolder PASSED [ 44%]
691test/test_sid.py::TestSID::test_lastChecked PASSED [ 45%]
692test/test_sid.py::TestSID::test_log PASSED [ 45%]
693test/test_sid.py::TestSID::test_log_filter PASSED [ 45%]
694test/test_sid.py::TestSID::test_makeDirs PASSED [ 45%]
695test/test_sid.py::TestSID::test_makeWritable PASSED [ 46%]
696test/test_sid.py::TestSID::test_name PASSED [ 46%]
697test/test_sid.py::TestSID::test_new_object_with_invalid_type PASSED [ 46%]
698test/test_sid.py::TestSID::test_new_object_with_invalid_value PASSED [ 46%]
699test/test_sid.py::TestSID::test_new_object_with_valid_date PASSED [ 46%]
700test/test_sid.py::TestSID::test_path PASSED [ 47%]
701test/test_sid.py::TestSID::test_setLog_binary PASSED [ 47%]
702test/test_sid.py::TestSID::test_sort_sids PASSED [ 47%]
703test/test_sid.py::TestSID::test_split PASSED [ 47%]
704test/test_sid.py::TestSID::test_tag PASSED [ 48%]
705test/test_sid.py::TestSID::test_withoutTag PASSED [ 48%]
706test/test_sid.py::TestNewSnapshot::test_create_new PASSED [ 48%]
707test/test_sid.py::TestNewSnapshot::test_hasChanges PASSED [ 48%]
708test/test_sid.py::TestNewSnapshot::test_saveToContinue PASSED [ 49%]
709test/test_sid.py::TestRootSnapshot::test_create PASSED [ 49%]
710test/test_sid.py::TestRootSnapshot::test_path PASSED [ 49%]
711test/test_sid.py::TestIterSnapshots::test_iter_snapshots PASSED [ 49%]
712test/test_sid.py::TestIterSnapshots::test_lastSnapshot PASSED [ 50%]
713test/test_sid.py::TestIterSnapshots::test_list_invalid_snapshot PASSED [ 50%]
714test/test_sid.py::TestIterSnapshots::test_list_new_snapshot PASSED [ 50%]
715test/test_sid.py::TestIterSnapshots::test_list_not_reverse PASSED [ 50%]
716test/test_sid.py::TestIterSnapshots::test_list_snapshot_without_backup PASSED [ 50%]
717test/test_sid.py::TestIterSnapshots::test_list_symlink_last_snapshot PASSED [ 51%]
718test/test_sid.py::TestIterSnapshots::test_list_valid PASSED [ 51%]
719test/test_sid.py::TestIterSnapshots::test_list_without_new_snapshot PASSED [ 51%]
720test/test_sid.py::TestIterSnapshotsNonexistingSnapshotPath::test_iterSnapshots PASSED [ 51%]
721test/test_sid.py::TestIterSnapshotsNonexistingSnapshotPath::test_lastSnapshots PASSED [ 52%]
722test/test_sid.py::TestIterSnapshotsNonexistingSnapshotPath::test_listSnapshots PASSED [ 52%]
723test/test_singleton.py::Test::test_multi_class PASSED [ 52%]
724test/test_singleton.py::Test::test_share_value PASSED [ 52%]
725test/test_singleton.py::Test::test_twins PASSED [ 53%]
726test/test_snapshotlog.py::TestLogFilter::test_filter PASSED [ 53%]
727test/test_snapshotlog.py::TestSnapshotLog::test_append PASSED [ 53%]
728test/test_snapshotlog.py::TestSnapshotLog::test_append_log_level PASSED [ 53%]
729test/test_snapshotlog.py::TestSnapshotLog::test_get PASSED [ 53%]
730test/test_snapshotlog.py::TestSnapshotLog::test_get_filter PASSED [ 54%]
731test/test_snapshotlog.py::TestSnapshotLog::test_new PASSED [ 54%]
732test/test_snapshotlog.py::TestSnapshotLog::test_new_continue PASSED [ 54%]
733test/test_snapshotlog.py::TestSnapshotLog::test_skipLines PASSED [ 54%]
734test/test_snapshotlog.py::TestSnapshotLog::test_skipLines_filtered PASSED [ 55%]
735test/test_snapshotlog.py::TestSnapshotLog::test_skipLines_show_all PASSED [ 55%]
736test/test_snapshots.py::SetTakeSnapshotMessage::test_error PASSED [ 55%]
737test/test_snapshots.py::SetTakeSnapshotMessage::test_info PASSED [ 55%]
738test/test_snapshots.py::UserAndGroups::test_gid_backup PASSED [ 56%]
739test/test_snapshots.py::UserAndGroups::test_gid_invalid PASSED [ 56%]
740test/test_snapshots.py::UserAndGroups::test_gid_valid PASSED [ 56%]
741test/test_snapshots.py::UserAndGroups::test_groupname_invalid PASSED [ 56%]
742test/test_snapshots.py::UserAndGroups::test_groupname_valid PASSED [ 57%]
743test/test_snapshots.py::UserAndGroups::test_uid_backup PASSED [ 57%]
744test/test_snapshots.py::UserAndGroups::test_uid_invalid PASSED [ 57%]
745test/test_snapshots.py::UserAndGroups::test_uid_valid PASSED [ 57%]
746test/test_snapshots.py::UserAndGroups::test_username_invalid PASSED [ 57%]
747test/test_snapshots.py::UserAndGroups::test_username_valid PASSED [ 58%]
748test/test_snapshots.py::HelperScripts::test_create_last_snapshot_symlink PASSED [ 58%]
749test/test_snapshots.py::HelperScripts::test_make_dirs PASSED [ 58%]
750test/test_snapshots.py::HelperScripts::test_rsync_remote_path PASSED [ 58%]
751test/test_snapshots.py::HelperScripts::test_stat_free_space_local PASSED [ 59%]
752test/test_snapshots.py::RsyncExcludeIncludeSuffix::test_exclude_unique_items PASSED [ 59%]
753test/test_snapshots.py::RsyncExcludeIncludeSuffix::test_include_root PASSED [ 59%]
754test/test_snapshots.py::RsyncExcludeIncludeSuffix::test_include_unique_items PASSED [ 59%]
755test/test_snapshots.py::RsyncExcludeIncludeSuffix::test_rsync_suffix PASSED [ 60%]
756test/test_snapshots.py::Callbacks::test_callback PASSED [ 60%]
757test/test_snapshots.py::Callbacks::test_dir PASSED [ 60%]
758test/test_snapshots.py::Callbacks::test_error PASSED [ 60%]
759test/test_snapshots.py::Callbacks::test_keep_params PASSED [ 61%]
760test/test_snapshots.py::Callbacks::test_restore PASSED [ 61%]
761test/test_snapshots.py::Callbacks::test_transfer PASSED [ 61%]
762test/test_snapshots.py::SnapshotWithSID::test_backup_config PASSED [ 61%]
763test/test_snapshots.py::SnapshotWithSID::test_backup_info_file PASSED [ 61%]
764test/test_snapshots.py::SnapshotWithSID::test_backup_permissions PASSED [ 62%]
765test/test_snapshots.py::SnapshotWithSID::test_collect_permission PASSED [ 62%]
766test/test_snapshots.py::RestorePathInfo::test_change_group PASSED [ 62%]
767test/test_snapshots.py::RestorePathInfo::test_change_owner_without_root PASSED [ 62%]
768test/test_snapshots.py::RestorePathInfo::test_change_permissions PASSED [ 63%]
769test/test_snapshots.py::RestorePathInfo::test_no_changes PASSED [ 63%]
770test/test_snapshots.py::DeletePath::test_dir PASSED [ 63%]
771test/test_snapshots.py::DeletePath::test_dir_readonly PASSED [ 63%]
772test/test_snapshots.py::DeletePath::test_file PASSED [ 64%]
773test/test_snapshots.py::DeletePath::test_file_readonly PASSED [ 64%]
774test/test_snapshots.py::DeletePath::test_pardir_readonly PASSED [ 64%]
775test/test_snapshots.py::RemoveSnapshot::test_remove PASSED [ 64%]
776test/test_snapshots.py::RemoveSnapshot::test_remove_read_only PASSED [ 65%]
777test/test_snapshots.py::SshSnapshots::test_stat_free_space_ssh PASSED [ 65%]
778test/test_snapshots.py::SshPermissions::test_backup_permissions PASSED [ 65%]
779test/test_snapshots.py::SshRemoveSnapshots::test_remove PASSED [ 65%]
780test/test_snapshots.py::SshRemoveSnapshots::test_remove_with_blank PASSED [ 65%]
781test/test_snapshots_autoremove.py::KeepFirst::test_all_invalid PASSED [ 66%]
782test/test_snapshots_autoremove.py::KeepFirst::test_ignore_unhealthy PASSED [ 66%]
783test/test_snapshots_autoremove.py::KeepFirst::test_keep_first_range_outside PASSED [ 66%]
784test/test_snapshots_autoremove.py::KeepFirst::test_min_included_max_not PASSED [ 66%]
785test/test_snapshots_autoremove.py::KeepFirst::test_no_date_ordering PASSED [ 67%]
786test/test_snapshots_autoremove.py::KeepFirst::test_one_but_set PASSED [ 67%]
787test/test_snapshots_autoremove.py::KeepFirst::test_simple_one PASSED [ 67%]
788test/test_snapshots_autoremove.py::KeepAllForLast::test_border PASSED [ 67%]
789test/test_snapshots_autoremove.py::KeepAllForLast::test_simple PASSED [ 68%]
790test/test_snapshots_autoremove.py::KeepOneForLastNDays::test_doc_example PASSED [ 68%]
791test/test_snapshots_autoremove.py::KeepOneForLastNWeeks::test_doc_example PASSED [ 68%]
792test/test_snapshots_autoremove.py::KeepOneForLastNMonths::test_doc_example PASSED [ 68%]
793test/test_snapshots_autoremove.py::KeepOnePerYearForAllYears::test_doc_example PASSED [ 69%]
794test/test_snapshots_autoremove.py::IncDecMonths::test_dec_leap_months PASSED [ 69%]
795test/test_snapshots_autoremove.py::IncDecMonths::test_dec_simple PASSED [ 69%]
796test/test_snapshots_autoremove.py::IncDecMonths::test_dec_year PASSED [ 69%]
797test/test_snapshots_autoremove.py::IncDecMonths::test_inc_leap_months PASSED [ 69%]
798test/test_snapshots_autoremove.py::IncDecMonths::test_inc_leap_year PASSED [ 70%]
799test/test_snapshots_autoremove.py::IncDecMonths::test_inc_next_year PASSED [ 70%]
800test/test_snapshots_autoremove.py::IncDecMonths::test_inc_simple PASSED [ 70%]
801test/test_sshtools.py::General::test_can_mount_ssh_rw PASSED [ 70%]
802test/test_sshtools.py::General::test_checkCipher_default PASSED [ 71%]
803test/test_sshtools.py::General::test_checkCipher_fail PASSED [ 71%]
804test/test_sshtools.py::General::test_checkCipher_specific PASSED [ 71%]
805test/test_sshtools.py::General::test_checkKnownHosts PASSED [ 71%]
806test/test_sshtools.py::General::test_checkKnownHosts_fail PASSED [ 72%]
807test/test_sshtools.py::General::test_checkLogin PASSED [ 72%]
808test/test_sshtools.py::General::test_checkLogin_fail_wrong_user PASSED [ 72%]
809test/test_sshtools.py::General::test_checkPingHost PASSED [ 72%]
810test/test_sshtools.py::General::test_checkPingHost_fail PASSED [ 73%]
811test/test_sshtools.py::General::test_checkRemoteFolder PASSED [ 73%]
812test/test_sshtools.py::General::test_checkRemoteFolder_fail_can_not_create PASSED [ 73%]
813test/test_sshtools.py::General::test_checkRemoteFolder_fail_not_a_folder PASSED [ 73%]
814test/test_sshtools.py::General::test_checkRemoteFolder_with_spaces PASSED [ 73%]
815test/test_sshtools.py::General::test_check_remote_command PASSED [ 74%]
816test/test_sshtools.py::General::test_check_remote_command_fail PASSED [ 74%]
817test/test_sshtools.py::General::test_check_remote_command_hard_link_fail PASSED [ 74%]
818test/test_sshtools.py::General::test_check_remote_command_with_spaces PASSED [ 74%]
819test/test_sshtools.py::General::test_randomId PASSED [ 75%]
820test/test_sshtools.py::General::test_unlockSshAgent PASSED [ 75%]
821test/test_sshtools.py::General::test_unlockSshAgent_fail PASSED [ 75%]
822test/test_sshtools.py::SshKey::test_fingerprint PASSED [ 75%]
823test/test_sshtools.py::SshKey::test_generate PASSED [ 76%]
824test/test_sshtools.py::SshKey::test_host_key PASSED [ 76%]
825test/test_sshtools.py::SshKey::test_write_known_host_file PASSED [ 76%]
826test/test_sshtools.py::StartSshAgent::test_equal_sign PASSED [ 76%]
827test/test_sshtools.py::StartSshAgent::test_error PASSED [ 76%]
828test/test_sshtools.py::StartSshAgent::test_export PASSED [ 77%]
829test/test_sshtools.py::StartSshAgent::test_just_start PASSED [ 77%]
830test/test_sshtools.py::StartSshAgent::test_missing PASSED [ 77%]
831test/test_sshtools.py::StartSshAgent::test_space PASSED [ 77%]
832test/test_sshtools.py::SSHCopyID::test_complete_command PASSED [ 78%]
833test/test_sshtools.py::SSHCopyID::test_custom_port PASSED [ 78%]
834test/test_sshtools.py::SSHCopyID::test_default_port PASSED [ 78%]
835test/test_sshtools.py::SSHCopyID::test_proxy_with_custom_port PASSED [ 78%]
836test/test_sshtools.py::SSHCopyID::test_proxy_with_default_port PASSED [ 79%]
837test/test_takeSnapshot.py::Take::test_error PASSED [ 79%]
838test/test_takeSnapshot.py::Take::test_error_without_continue PASSED [ 79%]
839test/test_takeSnapshot.py::Take::test_exclude PASSED [ 79%]
840test/test_takeSnapshot.py::Take::test_fail_create_new_snapshot PASSED [ 80%]
841test/test_takeSnapshot.py::Take::test_four_snapshots PASSED [ 80%]
842test/test_takeSnapshot.py::Take::test_new_exists PASSED [ 80%]
843test/test_takeSnapshot.py::Take::test_new_exists_continue PASSED [ 80%]
844test/test_takeSnapshot.py::Take::test_spaces_in_exclude PASSED [ 80%]
845test/test_takeSnapshot.py::Take::test_spaces_in_include PASSED [ 81%]
846test/test_takeSnapshot.py::TakeSSH::test_error PASSED [ 81%]
847test/test_takeSnapshot.py::TakeSSH::test_error_without_continue PASSED [ 81%]
848test/test_takeSnapshot.py::TakeSSH::test_exclude PASSED [ 81%]
849test/test_takeSnapshot.py::TakeSSH::test_fail_create_new_snapshot PASSED [ 82%]
850test/test_takeSnapshot.py::TakeSSH::test_four_snapshots PASSED [ 82%]
851test/test_takeSnapshot.py::TakeSSH::test_new_exists PASSED [ 82%]
852test/test_takeSnapshot.py::TakeSSH::test_new_exists_continue PASSED [ 82%]
853test/test_takeSnapshot.py::TakeSSH::test_spaces_in_exclude PASSED [ 83%]
854test/test_takeSnapshot.py::TakeSSH::test_spaces_in_include PASSED [ 83%]
855test/test_tools.py::TestTools::test_addSourceToPathEnviron PASSED [ 83%]
856test/test_tools.py::TestTools::test_backintimePath PASSED [ 83%]
857test/test_tools.py::TestTools::test_checkCommand PASSED [ 84%]
858test/test_tools.py::TestTools::test_checkCronPattern PASSED [ 84%]
859test/test_tools.py::TestTools::test_checkXServer PASSED [ 84%]
860test/test_tools.py::TestTools::test_decodeOctalEscape PASSED [ 84%]
861test/test_tools.py::TestTools::test_isRoot PASSED [ 84%]
862test/test_tools.py::TestTools::test_makeDirs PASSED [ 85%]
863test/test_tools.py::TestTools::test_makeDirs_not_writable PASSED [ 85%]
864test/test_tools.py::TestTools::test_md5sum PASSED [ 85%]
865test/test_tools.py::TestTools::test_mkdir PASSED [ 85%]
866test/test_tools.py::TestTools::test_mountArgs PASSED [ 86%]
867test/test_tools.py::TestTools::test_mountpoint PASSED [ 86%]
868test/test_tools.py::TestTools::test_patternHasNotEncryptableWildcard PASSED [ 86%]
869test/test_tools.py::TestTools::test_pids PASSED [ 86%]
870test/test_tools.py::TestTools::test_pidsWithName PASSED [ 87%]
871test/test_tools.py::TestTools::test_powerStatusAvailable PASSED [ 87%]
872test/test_tools.py::TestTools::test_preparePath PASSED [ 87%]
873test/test_tools.py::TestTools::test_processAlive PASSED [ 87%]
874test/test_tools.py::TestTools::test_processCmdline PASSED [ 88%]
875test/test_tools.py::TestTools::test_processCmdline_exception PASSED [ 88%]
876test/test_tools.py::TestTools::test_processExists PASSED [ 88%]
877test/test_tools.py::TestTools::test_processName PASSED [ 88%]
878test/test_tools.py::TestTools::test_processPaused PASSED [ 88%]
879test/test_tools.py::TestTools::test_processStat PASSED [ 89%]
880test/test_tools.py::TestTools::test_processStat_exception PASSED [ 89%]
881test/test_tools.py::TestTools::test_readFile PASSED [ 89%]
882test/test_tools.py::TestTools::test_readFileLines PASSED [ 89%]
883test/test_tools.py::TestTools::test_readTimeStamp PASSED [ 90%]
884test/test_tools.py::TestTools::test_registerBackintimePath PASSED [ 90%]
885test/test_tools.py::TestTools::test_rsyncCaps PASSED [ 90%]
886test/test_tools.py::TestTools::test_runningFromSource PASSED [ 90%]
887test/test_tools.py::TestTools::test_sharePath PASSED [ 91%]
888test/test_tools.py::TestTools::test_splitCommands PASSED [ 91%]
889test/test_tools.py::TestTools::test_usingSudo PASSED [ 91%]
890test/test_tools.py::TestTools::test_which PASSED [ 91%]
891test/test_tools.py::TestTools::test_writeTimeStamp PASSED [ 92%]
892test/test_tools.py::EscapeIPv6::test_escaped PASSED [ 92%]
893test/test_tools.py::EscapeIPv6::test_invalid PASSED [ 92%]
894test/test_tools.py::EscapeIPv6::test_passed PASSED [ 92%]
895test/test_tools.py::Environ::test_envLoad_do_not_overwrite_previous_values PASSED [ 92%]
896test/test_tools.py::Environ::test_envLoad_without_previous_values PASSED [ 93%]
897test/test_tools.py::Environ::test_envSave PASSED [ 93%]
898test/test_tools.py::ExecuteSubprocess::test_callback PASSED [ 93%]
899test/test_tools.py::ExecuteSubprocess::test_pausable PASSED [ 93%]
900test/test_tools.py::ExecuteSubprocess::test_returncode PASSED [ 94%]
901test/test_tools.py::Tools_FakeFS::test_git_repo_info PASSED [ 94%]
902test/test_tools.py::Tools_FakeFS::test_git_repo_info_none PASSED [ 94%]
903test/test_tools.py::ValidateSnapshotsPath::test_fails_on_ro PASSED [ 94%]
904test/test_tools.py::ValidateSnapshotsPath::test_permission_fail PASSED [ 95%]
905test/test_tools.py::ValidateSnapshotsPath::test_writes PASSED [ 95%]
906test/test_tools.py::OlderThan::test_days_not_older PASSED [ 95%]
907test/test_tools.py::OlderThan::test_days_older PASSED [ 95%]
908test/test_tools.py::OlderThan::test_hours_not_older PASSED [ 96%]
909test/test_tools.py::OlderThan::test_hours_older PASSED [ 96%]
910test/test_tools.py::OlderThan::test_month_31th PASSED [ 96%]
911test/test_tools.py::OlderThan::test_month_31th_plus_ms PASSED [ 96%]
912test/test_tools.py::OlderThan::test_month_next_year PASSED [ 96%]
913test/test_tools.py::OlderThan::test_month_next_year_plus_ms PASSED [ 97%]
914test/test_tools.py::OlderThan::test_month_not_older PASSED [ 97%]
915test/test_tools.py::OlderThan::test_month_older PASSED [ 97%]
916test/test_tools.py::OlderThan::test_week_not_older PASSED [ 97%]
917test/test_tools.py::OlderThan::test_week_older PASSED [ 98%]
918test/test_tools.py::NestedDictUpdate::test_simple PASSED [ 98%]
919test/test_uniquenessset.py::General::test_001_depency_workaround PASSED [ 98%]
920test/test_uniquenessset.py::General::test_ctor_defaults PASSED [ 98%]
921test/test_uniquenessset.py::General::test_deep_check PASSED [ 99%]
922test/test_uniquenessset.py::General::test_fail_equal_without_equal_to PASSED [ 99%]
923test/test_uniquenessset.py::General::test_size_mtime PASSED [ 99%]
924test/test_uniquenessset.py::General::test_unique_myself PASSED [ 99%]
925test/test_uniquenessset.py::General::test_unique_size_but_different_mtime PASSED [100%]
927=================================== FAILURES ===================================
928_____________ MirrorMirrorOnTheWall.test020_flake8_default_ruleset _____________
930self = <test.test_lint.MirrorMirrorOnTheWall testMethod=test020_flake8_default_ruleset>
932 @unittest.skipUnless(FLAKE8_AVAILABLE, BASE_REASON.format('flake8'))
933 def test020_flake8_default_ruleset(self):
934 """Flake8 in default mode."""
935 cmd = [
936 'flake8',
937 f'--max-line-length={PEP8_MAX_LINE_LENGTH}',
938 '--builtins=_,ngettext',
939 # '--enable-extensions='
940 ]
942 cmd.extend(full_test_files)
944 proc = subprocess.run(
945 cmd,
946 check=False,
947 universal_newlines=True,
948 capture_output=True
949 )
951 error_n = len(proc.stdout.splitlines())
952 if error_n > 0:
953 print(proc.stdout)
955> self.assertEqual(0, error_n, f'Flake8 found {error_n} problem(s).')
956E AssertionError: 0 != 1 : Flake8 found 1 problem(s).
958test/test_lint.py:257: AssertionError
959----------------------------- Captured stdout call -----------------------------
960/home/travis/build/bit-team/backintime/common/test/test_mount.py:220:5: E303 too many blank lines (2)
962=========================== short test summary info ============================
963FAILED test/test_lint.py::MirrorMirrorOnTheWall::test020_flake8_default_ruleset - AssertionError: 0 != 1 : Flake8 found 1 problem(s).
964============= 1 failed, 424 passed, 1 skipped in 63.59s (0:01:03) ==============
965make: *** [Makefile:620: unittest-v] Error 1
966The command "make unittest-v" exited with 2.
9670.00s$ cd ..
968The command "cd .." exited with 0.
9690.00s$ cd qt
970The command "cd qt" exited with 0.
9710.06s$ ./configure
972Replacement of python path with "/usr/bin/python3" successful.
973All OK. Now run:
974 make
975 sudo make install
976The command "./configure" exited with 0.
9770.01s$ make
978# Man pages
979for i in $(ls -1 man/C/); do case $i in *.gz|*~) continue;; *) gzip -n --best -c man/C/$i > man/C/${i}.gz;; esac; done
980The command "make" exited with 0.
98122.05s$ pytest --verbose
982============================= test session starts ==============================
983platform linux -- Python 3.13.1, pytest-8.3.4, pluggy-1.5.0 -- /home/travis/virtualenv/python3.13.1/bin/python
984cachedir: .pytest_cache
985rootdir: /home/travis/build/bit-team/backintime/qt
986plugins: pyfakefs-5.7.4
987collected 9 items
989test/test_lint.py::MirrorMirrorOnTheWall::test005_ensure_linter_versions PASSED [ 11%]
990test/test_lint.py::MirrorMirrorOnTheWall::test010_ruff_default_ruleset PASSED [ 22%]
991test/test_lint.py::MirrorMirrorOnTheWall::test020_flake8_default_ruleset PASSED [ 33%]
992test/test_lint.py::MirrorMirrorOnTheWall::test030_pylint_default_ruleset PASSED [ 44%]
993test/test_lint.py::MirrorMirrorOnTheWall::test050_pylint_exclusive_ruleset PASSED [ 55%]
994test/test_statedata.py::IsSingleton::test_content PASSED [ 66%]
995test/test_statedata.py::IsSingleton::test_identity PASSED [ 77%]
996test/test_statedata.py::Properties::test_profile_not_exist PASSED [ 88%]
997test/test_statedata.py::Properties::test_read_empty_global PASSED [100%]
999============================== 9 passed in 21.80s ==============================
1000The command "pytest --verbose" exited with 0.
1003Done. Your build exited with 1.
Top